{"text_format":"1","workbook":"xlsx","n_sheets":13,"sheets":["User's Guide","Activity Description","CB_DATA_","ERR & Sensitivity Analysis","ERR","Assumptions","Costs","Savings","Health","Commercial","Beneficiaries","Poverty Scorecard","Sensitivity"],"not_rendered":{"charts":2,"images":13,"macros":1,"external_links":0,"defined_names":63,"comments":0,"pivot_tables":0},"unopened":[],"bounds":{"document_bytes":16777216,"sheet_cells":100000,"rows_first":2000,"rows_last":500,"rows_between":2000,"halvings":0,"cell_chars":16384,"cell_head_chars":4096},"cells_cut":0,"cells_raw":0,"read":"whole","date_system":"1900"}

{"sheet":"User's Guide","index":0,"n_rows":52,"n_cols":4,"rows_kept":52,"cut":false,"hidden":false,"merged":[[51,1,51,3],[24,1,24,3],[27,1,27,3],[12,1,16,1],[1,2,4,3],[5,2,6,3],[17,1,18,1]]}
[]
[null,null,"Tanzania: Water Sector Project"]
[]
[]
[]
[null,null,"Lower Ruvu Plant Expansion Activity"]
[]
[]
[null,"ERR Version","Original ERR","Closeout ERR"]
[null,"Date of ERR","2007-08-24","2016-02-08"]
{"$rows_left_out":43}
{"sheet":"Activity Description","index":1,"n_rows":45,"n_cols":2,"rows_kept":45,"cut":false,"hidden":false,"merged":[]}
[]
[null,"Tanzania:  Lower Ruvu Plant Expansion Activity"]
[]
[null,"Lower Ruvu Plant Expansion Activity"]
[]
[null,"Activity Design History"]
[]
[null,"Original Project"]
[]
[null,"Tanzania faces a serious shortage of access to potable water, resulting in a high incidence of water-related diseases, decreased workforce productivity, and constrained business growth. The Lower Ruvu Plant Expansion Activity includes investments in bulk water supply for the Dar es Salaam urban water system, which will increase the quantity and reliability of potable water for domestic and commercial use."]
{"$rows_left_out":36}
{"sheet":"CB_DATA_","index":2,"n_rows":28,"n_cols":16,"rows_kept":28,"cut":false,"hidden":true,"merged":[]}
["Crystal Ball Data"]
[null,null,null,null,null,null,null,null,null,null,null,null,null,null,null,{"$f":"_xll.CB.RecalcCounterFN()","v":{"$error":"#NAME?"}}]
["Workbook Variables","Last Var Column",0]
["    Name:"]
["    Value:"]
[]
["Worksheet Data","Last Data Column Used"]
[null,3]
[]
["Sheet Ref"]
{"$rows_left_out":19}
{"sheet":"ERR & Sensitivity Analysis","index":3,"n_rows":34,"n_cols":9,"rows_kept":34,"cut":false,"hidden":false,"merged":[[20,1,20,6],[57,2,57,6],[5,1,5,6],[7,1,8,1],[7,2,8,2],[7,3,7,6]]}
[]
[null,"Tanzania:  Lower Ruvu Plant Expansion Activity",null,null,null,"Last updated: 2/8/2016"]
[]
[null,"ERR and sensitivity analysis"]
[]
[null,"Change the \"User Input\" cells in the table below to see the effect on the compact's Economic Rate of Return (ERR) and net benefits (see chart below).  To reset all values to the default MCC estimates, click the \"Reset Parameters\" button at right.  Be sure to reset all summary parameters to their original values (\"MCC Estimate\" values) before changing specific parameters."]
[]
[null,"Parameter type","Description of key parameters","Parameter values"]
[null,null,null,"User Input","MCC Estimate","Plausible range","Values used in ERR computation",null,"All summary parameters set to initial values?"]
[null,"Summary","Actual costs as a percentage of estimated costs",1,1,"80 - 120%",{"$f":"D10","v":1},null,{"$f":"IF(D10=E10,IF(D11=E11,\"Y\",\"N\"),\"N\")","v":"Y"}]
{"$rows_left_out":25}
{"sheet":"ERR","index":4,"n_rows":56,"n_cols":30,"rows_kept":56,"cut":false,"hidden":false,"merged":[[52,2,52,10]]}
[null,"Tanzania:  Lower Ruvu Plant Expansion Activity",null,null,null,null,null,null,null,"Last updated: 2/8/2016"]
[null,"Cost-Benefit Summary"]
[]
[null,null,null,null,{"$f":"IF('ERR & Sensitivity Analysis'!$I$10=\"N\",\"Note: Current calculations are based on user input and are not the original MCC estimates.\",IF('ERR & Sensitivity Analysis'!$I$13=\"N\",\"Note: Current calculations are based on user input and are not the original MCC estimates.\",\"\"))","v":""}]
[null,null,null,null,"All figures in millions of US$",2008,2009,2010,2011,2012,2013,2014,2015,2016,2017,2018,2019,2020,2021,2022,2023,2024,2025,2026,2027,2028]
[null,null,null,null,"Year",0,1,2,3,4,5,6,7,8,9,10,11,12,13,14,15,16,17,18,19,20]
[null,null,"Costs"]
[]
[null,null,null,null,"Disbursement rate",{"$f":"SUM(G9:K9)","v":1},0,0,0.39,0.32,{"$f":"1-SUM(G9:J9)","v":0.29000000000000004},null,null,null,null,null,null,null,null,null,null,null,null,null,null,null,null,null,"Present Value","% of Costs"]
[]
{"$rows_left_out":47}
{"sheet":"Assumptions","index":5,"n_rows":108,"n_cols":14,"rows_kept":108,"cut":false,"hidden":false,"merged":[]}
[null,"Tanzania:  Lower Ruvu Plant Expansion Activity",null,null,null,null,null,null,null,"Last updated: 2/8/2016"]
[null,"Consumer Profile & Assumptions"]
[]
[null,{"$f":"IF('ERR & Sensitivity Analysis'!$I$10=\"N\",\"Note: Current calculations are based on user input and are not the original MCC estimates.\",IF('ERR & Sensitivity Analysis'!$I$13=\"N\",\"Note: Current calculations are based on user input and are not the original MCC estimates.\",\"\"))","v":""}]
[]
[null,"Without Project",null,null,null,null,null,null,null,null,null,"Household Treatment Costs"]
[null,null,null,null,null,null,null,null,null,null,{"$f":"A75","v":8},"Volume treated (liters/capita/day)",{"$f":"'ERR & Sensitivity Analysis'!G13","v":3}]
[{"$f":"A68","v":1},"Primary drinking water source","% of HH","Liters / capita / day (lpcpd)","Cost of water (Tsh/liter)","% of water treated","Treatment cost (Tsh/liter)","Total cost (Tsh/liter)",null,null,null,"Cost of boiling water","Column1"]
[null,"Own tap",0.13,114.5,{"$f":"M27/1000","v":1.077},{"$f":"M7/Table4[[#This Row],[Liters / capita / day (lpcpd)]]","v":2.6200873362445413E-2},{"$f":"SUMPRODUCT(C16:G16,C$21:G$21)","v":22.788570939949462},{"$f":"Table4[[#This Row],[Cost of water (Tsh/liter)]]+(Table4[[#This Row],[% of water treated]]*Table4[[#This Row],[Treatment cost (Tsh/liter)]])","v":1.6740804613087195},null,null,{"$f":"A77","v":9},"Average annual temperature in Dar es Salaam (Co)",26.1]
[null,"Other piped",0.39,5,{"$f":"M27/1000","v":1.077},{"$f":"M7/Table4[[#This Row],[Liters / capita / day (lpcpd)]]","v":0.6},{"$f":"SUMPRODUCT(C17:G17,C$21:G$21)","v":11.441865201999642},{"$f":"Table4[[#This Row],[Cost of water (Tsh/liter)]]+(Table4[[#This Row],[% of water treated]]*Table4[[#This Row],[Treatment cost (Tsh/liter)]])","v":7.9421191211997852},null,null,{"$f":"A79","v":10},"Energy required to boil 1 liter water in Dar es Salaam (kcal)",{"$f":"100-M9","v":73.900000000000006}]
{"$rows_left_out":99}
{"sheet":"Costs","index":6,"n_rows":30,"n_cols":11,"rows_kept":30,"cut":false,"hidden":false,"merged":[]}
[null,"Tanzania:  Lower Ruvu Plant Expansion Activity",null,null,null,null,null,null,null,null,"Last updated: 2/8/2016"]
[null,"Costs"]
[null,{"$f":"IF('ERR & Sensitivity Analysis'!$I$10=\"N\",\"Note: Current calculations are based on user input and are not the original MCC estimates.\",IF('ERR & Sensitivity Analysis'!$I$13=\"N\",\"Note: Current calculations are based on user input and are not the original MCC estimates.\",\"\"))","v":""}]
[]
[{"$f":"A27","v":1},"Investment costs (US$)","MCA-T","GoT","Total"]
[null,"Capital costs",37831487.422999993,6871781.7555951597,{"$f":"SUM(C6:D6)","v":44703269.178595155}]
[null,"Supervision",3081510,1146155.24,4227665.24]
[null,"Feasibility studies",4474651.79,0,4474651.79]
[null,"Technical assistance",323517.7,0,323517.7]
[null,"Administrative costs",1755584.6962394044,0,1755584.6962394044]
{"$rows_left_out":21}
{"sheet":"Savings","index":7,"n_rows":61,"n_cols":26,"rows_kept":61,"cut":false,"hidden":false,"merged":[]}
[null,"Tanzania:  Lower Ruvu Plant Expansion Activity",null,null,null,null,null,null,null,"Last updated: 2/8/2016"]
[null,"User Cost Savings Benefits"]
[]
[null,null,null,null,{"$f":"IF('ERR & Sensitivity Analysis'!$I$10=\"N\",\"Note: Current calculations are based on user input and are not the original MCC estimates.\",IF('ERR & Sensitivity Analysis'!$I$13=\"N\",\"Note: Current calculations are based on user input and are not the original MCC estimates.\",\"\"))","v":""}]
[null,null,null,null,"All figures in 2014 US$ unless specified",2008,2009,2010,2011,2012,2013,2014,2015,2016,2017,2018,2019,2020,2021,2022,2023,2024,2025,2026,2027,2028]
[null,null,null,null,"Year",0,1,2,3,4,5,6,7,8,9,10,11,12,13,14,15,16,17,18,19,20]
[null,null,null,null,"Benefits?",0,0,0,0,0,0,1,1,1,1,1,1,1,1,1,1,1,1,1,1,1]
[null,null,"Population of area served by DAWASCO",null,null,{"$f":"Beneficiaries!L15","v":2300027.2719641686},{"$f":"Beneficiaries!M15","v":2428828.7991941622},{"$f":"Beneficiaries!N15","v":2564843.2119490355},{"$f":"Beneficiaries!O15","v":2708474.4318181816},{"$f":"Beneficiaries!P15","v":2860149},{"$f":"Beneficiaries!Q15","v":3020317.344},{"$f":"Beneficiaries!R15","v":3189455.1152640004},{"$f":"Beneficiaries!S15","v":3368064.6017187848},{"$f":"Beneficiaries!T15","v":3556676.219415037},{"$f":"Beneficiaries!U15","v":3755850.087702279},{"$f":"Beneficiaries!V15","v":3966177.6926136068},{"$f":"Beneficiaries!W15","v":4188283.6433999692},{"$f":"Beneficiaries!X15","v":4422827.5274303677},{"$f":"Beneficiaries!Y15","v":4670505.8689664686},{"$f":"Beneficiaries!Z15","v":4932054.1976285912},{"$f":"Beneficiaries!AA15","v":5208249.2326957928},{"$f":"Beneficiaries!AB15","v":5499911.1897267578},{"$f":"Beneficiaries!AC15","v":5807906.2163514569},{"$f":"Beneficiaries!AD15","v":6133148.964467139},{"$f":"Beneficiaries!AE15","v":6476605.306477299},{"$f":"Beneficiaries!AF15","v":6839295.2036400279}]
[null,null,"Households in area served by DAWASCO",null,null,{"$f":"Beneficiaries!L31","v":577093.52836680901},{"$f":"Beneficiaries!M31","v":609410.76595535036},{"$f":"Beneficiaries!N31","v":643537.76884885004},{"$f":"Beneficiaries!O31","v":679575.88390438573},{"$f":"Beneficiaries!P31","v":717632.13340303139},{"$f":"Beneficiaries!Q31","v":757819.53287360107},{"$f":"Beneficiaries!R31","v":800257.42671452288},{"$f":"Beneficiaries!S31","v":845071.84261053626},{"$f":"Beneficiaries!T31","v":892395.86579672631},{"$f":"Beneficiaries!U31","v":942370.03428134299},{"$f":"Beneficiaries!V31","v":995142.75620109821},{"$f":"Beneficiaries!W31","v":1050870.7505483599},{"$f":"Beneficiaries!X31","v":1109719.5125790681},{"$f":"Beneficiaries!Y31","v":1171863.8052834959},{"$f":"Beneficiaries!Z31","v":1237488.1783793718},{"$f":"Beneficiaries!AA31","v":1306787.5163686168},{"$f":"Beneficiaries!AB31","v":1379967.6172852595},{"$f":"Beneficiaries!AC31","v":1457245.803853234},{"$f":"Beneficiaries!AD31","v":1538851.5688690154},{"$f":"Beneficiaries!AE31","v":1625027.2567256803},{"$f":"Beneficiaries!AF31","v":1716028.7831023184}]
[]
{"$rows_left_out":52}
{"sheet":"Health","index":8,"n_rows":118,"n_cols":26,"rows_kept":118,"cut":false,"hidden":false,"merged":[]}
[null,"Tanzania:  Lower Ruvu Plant Expansion Activity",null,null,null,null,null,null,null,"Last updated: 2/8/2016"]
[null,"Health Benefits"]
[]
[null,null,null,null,{"$f":"IF('ERR & Sensitivity Analysis'!$I$10=\"N\",\"Note: Current calculations are based on user input and are not the original MCC estimates.\",IF('ERR & Sensitivity Analysis'!$I$13=\"N\",\"Note: Current calculations are based on user input and are not the original MCC estimates.\",\"\"))","v":""}]
[null,null,null,null,"All figures in 2014 US$ unless specified",2008,2009,2010,2011,2012,2013,2014,2015,2016,2017,2018,2019,2020,2021,2022,2023,2024,2025,2026,2027,2028]
[null,null,null,null,"Year",0,1,2,3,4,5,6,7,8,9,10,11,12,13,14,15,16,17,18,19,20]
[null,null,null,null,"Benefits?",0,0,0,0,0,0,{"$f":"IF(1/Assumptions!$N$54+K7<=1, 1/Assumptions!$N$54+K7, 1)","v":0.33333333333333331},{"$f":"IF(1/Assumptions!$N$54+L7<=1, 1/Assumptions!$N$54+L7, 1)","v":0.66666666666666663},{"$f":"IF(1/Assumptions!$N$54+M7<=1, 1/Assumptions!$N$54+M7, 1)","v":1},{"$f":"IF(1/Assumptions!$N$54+N7<=1, 1/Assumptions!$N$54+N7, 1)","v":1},{"$f":"IF(1/Assumptions!$N$54+O7<=1, 1/Assumptions!$N$54+O7, 1)","v":1},{"$f":"IF(1/Assumptions!$N$54+P7<=1, 1/Assumptions!$N$54+P7, 1)","v":1},{"$f":"IF(1/Assumptions!$N$54+Q7<=1, 1/Assumptions!$N$54+Q7, 1)","v":1},{"$f":"IF(1/Assumptions!$N$54+R7<=1, 1/Assumptions!$N$54+R7, 1)","v":1},{"$f":"IF(1/Assumptions!$N$54+S7<=1, 1/Assumptions!$N$54+S7, 1)","v":1},{"$f":"IF(1/Assumptions!$N$54+T7<=1, 1/Assumptions!$N$54+T7, 1)","v":1},{"$f":"IF(1/Assumptions!$N$54+U7<=1, 1/Assumptions!$N$54+U7, 1)","v":1},{"$f":"IF(1/Assumptions!$N$54+V7<=1, 1/Assumptions!$N$54+V7, 1)","v":1},{"$f":"IF(1/Assumptions!$N$54+W7<=1, 1/Assumptions!$N$54+W7, 1)","v":1},{"$f":"IF(1/Assumptions!$N$54+X7<=1, 1/Assumptions!$N$54+X7, 1)","v":1},{"$f":"IF(1/Assumptions!$N$54+Y7<=1, 1/Assumptions!$N$54+Y7, 1)","v":1}]
[null,null,"Population using DAWASCO sources",null,null,{"$f":"Beneficiaries!L20","v":0},{"$f":"Beneficiaries!M20","v":1262990.9755809642},{"$f":"Beneficiaries!N20","v":1333718.4702134985},{"$f":"Beneficiaries!O20","v":1408406.7045454546},{"$f":"Beneficiaries!P20","v":1487277.48},{"$f":"Beneficiaries!Q20","v":1570565.0188799999},{"$f":"Beneficiaries!R20","v":1658516.6599372802},{"$f":"Beneficiaries!S20","v":1751393.5928937681},{"$f":"Beneficiaries!T20","v":1849471.6340958192},{"$f":"Beneficiaries!U20","v":1953042.0456051852},{"$f":"Beneficiaries!V20","v":2062412.4001590756},{"$f":"Beneficiaries!W20","v":2177907.4945679842},{"$f":"Beneficiaries!X20","v":2299870.3142637913},{"$f":"Beneficiaries!Y20","v":2428663.0518625635},{"$f":"Beneficiaries!Z20","v":2564668.1827668673},{"$f":"Beneficiaries!AA20","v":2708289.6010018126},{"$f":"Beneficiaries!AB20","v":2859953.8186579146},{"$f":"Beneficiaries!AC20","v":3020111.2325027576},{"$f":"Beneficiaries!AD20","v":3189237.4615229126},{"$f":"Beneficiaries!AE20","v":3367834.7593681957},{"$f":"Beneficiaries!AF20","v":3556433.5058928141}]
[null,null,null,"Age < 5",null,{"$f":"Beneficiaries!L21","v":0},{"$f":"Beneficiaries!M21","v":184396.68243482077},{"$f":"Beneficiaries!N21","v":194722.89665117077},{"$f":"Beneficiaries!O21","v":205627.37886363635},{"$f":"Beneficiaries!P21","v":217142.51207999999},{"$f":"Beneficiaries!Q21","v":229302.49275647997},{"$f":"Beneficiaries!R21","v":242143.43235084289},{"$f":"Beneficiaries!S21","v":255703.46456249012},{"$f":"Beneficiaries!T21","v":270022.85857798957},{"$f":"Beneficiaries!U21","v":285144.13865835703},{"$f":"Beneficiaries!V21","v":301112.21042322501},{"$f":"Beneficiaries!W21","v":317974.49420692568},{"$f":"Beneficiaries!X21","v":335781.06588251353},{"$f":"Beneficiaries!Y21","v":354584.80557193427},{"$f":"Beneficiaries!Z21","v":374441.5546839626},{"$f":"Beneficiaries!AA21","v":395410.28174626461},{"$f":"Beneficiaries!AB21","v":417553.25752405549},{"$f":"Beneficiaries!AC21","v":440936.2399454026},{"$f":"Beneficiaries!AD21","v":465628.66938234522},{"$f":"Beneficiaries!AE21","v":491703.87486775656},{"$f":"Beneficiaries!AF21","v":519239.29186035082}]
[null,null,null,"Age 5-18",null,{"$f":"Beneficiaries!L22","v":0},{"$f":"Beneficiaries!M22","v":337218.59048011748},{"$f":"Beneficiaries!N22","v":356102.83154700411},{"$f":"Beneficiaries!O22","v":376044.5901136364},{"$f":"Beneficiaries!P22","v":397103.08716},{"$f":"Beneficiaries!Q22","v":419340.86004096002},{"$f":"Beneficiaries!R22","v":442823.94820325385},{"$f":"Beneficiaries!S22","v":467622.0893026361},{"$f":"Beneficiaries!T22","v":493808.92630358378},{"$f":"Beneficiaries!U22","v":521462.22617658449},{"$f":"Beneficiaries!V22","v":550664.11084247322},{"$f":"Beneficiaries!W22","v":581501.30104965181},{"$f":"Beneficiaries!X22","v":614065.37390843232},{"$f":"Beneficiaries!Y22","v":648453.03484730446},{"$f":"Beneficiaries!Z22","v":684766.40479875356},{"$f":"Beneficiaries!AA22","v":723113.32346748398},{"$f":"Beneficiaries!AB22","v":763607.66958166321},{"$f":"Beneficiaries!AC22","v":806369.69907823636},{"$f":"Beneficiaries!AD22","v":851526.40222661768},{"$f":"Beneficiaries!AE22","v":899211.88075130829},{"$f":"Beneficiaries!AF22","v":949567.74607338139}]
{"$rows_left_out":109}
{"sheet":"Commercial","index":9,"n_rows":36,"n_cols":26,"rows_kept":36,"cut":false,"hidden":false,"merged":[]}
[null,"Tanzania:  Lower Ruvu Plant Expansion Activity",null,null,null,null,null,null,null,"Last updated: 2/8/2016"]
[null,"Water Flow & Commercial Consumption"]
[]
[null,null,null,null,{"$f":"IF('ERR & Sensitivity Analysis'!$I$10=\"N\",\"Note: Current calculations are based on user input and are not the original MCC estimates.\",IF('ERR & Sensitivity Analysis'!$I$13=\"N\",\"Note: Current calculations are based on user input and are not the original MCC estimates.\",\"\"))","v":""}]
[null,null,null,null,"All figures in 2014 US$ unless specified",2008,2009,2010,2011,2012,2013,2014,2015,2016,2017,2018,2019,2020,2021,2022,2023,2024,2025,2026,2027,2028]
[null,null,null,null,"Year",0,1,2,3,4,5,6,7,8,9,10,11,12,13,14,15,16,17,18,19,20]
[null,null,"Without Project"]
[]
[null,null,"Water produced by DAWASCO (m3)",null,null,null,{"$f":"Savings!G13","v":52327064.299999997},{"$f":"Savings!H13","v":52327064.299999997},{"$f":"Savings!I13","v":52327064.299999997},{"$f":"Savings!J13","v":52327064.299999997},{"$f":"Savings!K13","v":52327064.299999997},{"$f":"Savings!L13","v":52327064.299999997},{"$f":"Savings!M13","v":52327064.299999997},{"$f":"Savings!N13","v":52327064.299999997},{"$f":"Savings!O13","v":52327064.299999997},{"$f":"Savings!P13","v":52327064.299999997},{"$f":"Savings!Q13","v":52327064.299999997},{"$f":"Savings!R13","v":52327064.299999997},{"$f":"Savings!S13","v":52327064.299999997},{"$f":"Savings!T13","v":52327064.299999997},{"$f":"Savings!U13","v":52327064.299999997},{"$f":"Savings!V13","v":52327064.299999997},{"$f":"Savings!W13","v":52327064.299999997},{"$f":"Savings!X13","v":52327064.299999997},{"$f":"Savings!Y13","v":52327064.299999997},{"$f":"Savings!Z13","v":52327064.299999997}]
[null,null,null,"Lower Ruvu",null,null,{"$f":"cap_wop*365*(1-(nrw*techloss))","v":36529199.999999993},36529199.999999993,36529199.999999993,36529199.999999993,36529199.999999993,36529199.999999993,36529199.999999993,36529199.999999993,36529199.999999993,36529199.999999993,36529199.999999993,36529199.999999993,36529199.999999993,36529199.999999993,36529199.999999993,36529199.999999993,36529199.999999993,36529199.999999993,36529199.999999993,36529199.999999993]
{"$rows_left_out":27}
{"sheet":"Beneficiaries","index":10,"n_rows":44,"n_cols":32,"rows_kept":44,"cut":false,"hidden":false,"merged":[]}
[null,"Tanzania: Lower Ruvu Plant Expansion Activity",null,null,null,null,null,null,null,null,null,null,null,null,null,null,null,"Last updated: 2/8/2016"]
[null,"Beneficiary Estimates"]
[]
[null,null,null,{"$f":"IF('ERR & Sensitivity Analysis'!$I$10=\"N\",\"Note: Current calculations are based on user input and are not the original MCC estimates.\",IF('ERR & Sensitivity Analysis'!$I$13=\"N\",\"Note: Current calculations are based on user input and are not the original MCC estimates.\",\"\"))","v":""}]
[null,null,null,null,null,null,null,null,null,null,null,2008,2009,2010,2011,2012,2013,2014,2015,2016,2017,2018,2019,2020,2021,2022,2023,2024,2025,2026,2027,2028]
[null,null,null,null,"Year",null,null,null,null,null,null,0,1,2,3,4,5,6,7,8,9,10,11,12,13,14,15,16,17,18,19,20]
[null,null,"Tanzania Population",null,null,null,null,null,null,null,null,null,null,null,null,"2012 Census"]
[null,null,"Region",null,"Growth rate","2002 Census",2003,2004,2005,2006,2007]
[null,{"$f":"C40","v":1},"Tanzania Total",null,2.7E-2,34443603,{"$f":"F9*(1+$E9)","v":35373580.280999996},36328666.948586993,37309540.956198841,38316898.562016204,{"$f":"J9*(1+$E9)","v":39351454.823190637},{"$f":"K9*(1+$E9)","v":40413944.103416778},41505120.59420903,42625758.850252673,43776654.33920949,44928923,{"$f":"P9*(1+$E9)","v":46142003.920999996},{"$f":"Q9*(1+$E9)","v":47387838.026866995},48667309.6535924,49981327.014239393,51330822.843623854,52716755.060401693,54140107.447032534,55601890.348102406,57103141.387501165,58644926.204963692,60228339.212497704,61854504.37123514,63524575.989258483,65239739.540968455,67001212.508574598,68810245.246306106]
[null,{"$f":"C40","v":1},"Dar es Salaam Region",null,5.6000000000000001E-2,null,null,null,null,null,null,{"$f":"M10/(1+$E10)","v":3509804.3247417407},3706353.3669272782,3913909.1554752062,{"$f":"P10/(1+$E10)","v":4133088.0681818179},4364541,4608955.2960000001,{"$f":"Q10*(1+$E10)","v":4867056.7925760001},{"$f":"R10*(1+$E10)","v":5139611.972960256},{"$f":"S10*(1+$E10)","v":5427430.2434460307},{"$f":"T10*(1+$E10)","v":5731366.337079009},{"$f":"U10*(1+$E10)","v":6052322.8519554334},{"$f":"V10*(1+$E10)","v":6391252.9316649381},{"$f":"W10*(1+$E10)","v":6749163.0958381752},{"$f":"X10*(1+$E10)","v":7127116.2292051129},{"$f":"Y10*(1+$E10)","v":7526234.7380406},{"$f":"Z10*(1+$E10)","v":7947703.8833708735},{"$f":"AA10*(1+$E10)","v":8392775.3008396421},{"$f":"AB10*(1+$E10)","v":8862770.7176866625},{"$f":"AC10*(1+$E10)","v":9359085.8778771162},{"$f":"AD10*(1+$E10)","v":9883194.6870382354},{"$f":"AE10*(1+$E10)","v":10436653.589512376}]
{"$rows_left_out":35}
{"sheet":"Poverty Scorecard","index":11,"n_rows":50,"n_cols":19,"rows_kept":50,"cut":false,"hidden":false,"merged":[[34,18,38,18],[3,1,3,8],[4,2,4,7],[6,1,6,7],[7,1,7,7],[13,4,13,7],[25,18,29,18]]}
[null,0,null,null,null,null,null,null,null,null,"Last updated: 2/8/2016"]
[]
[]
[null,"Poverty Scorecard"]
[]
[]
[null,"Tanzania: Lower Ruvu Plant Expansion Activity"]
[null,{"$f":"IF('ERR & Sensitivity Analysis'!$I$10=\"N\",\"Note: Current calculations are based on user input and are not the original MCC estimates.\",IF('ERR & Sensitivity Analysis'!$I$13=\"N\",\"Note: Current calculations are based on user input and are not the original MCC estimates.\",\"\"))","v":""},null,null,null,null,null,null,null,null,"Bar Chart Data"]
[null,null,"2013 US$",null,"2005 PPP $",null,null,null,null,null,"Activity/Sub-activity","Lower Ruvu Plant Expansion Activity","National Income Distribution"]
[null,"MCC Cost (Millions US$)",{"$f":"Costs!C13/10^6","v":48.828663241973615},null,{"$f":"C10*(99.991/106.442)","v":45.869364219276079},null,null,null,null,null,"Consump. <$1.25/day",{"$f":"E32","v":3.2749039605212598E-3},{"$f":"R18","v":0.12758791923351906}]
{"$rows_left_out":41}
{"sheet":"Sensitivity","index":12,"n_rows":361,"n_cols":11,"rows_kept":361,"cut":false,"hidden":false,"merged":[]}
[0,"Tanzania:  Lower Ruvu Plant Expansion Activity",null,null,null,null,null,null,null,"Last updated: 2/8/2016"]
[null,"Sensitivity Analysis"]
[]
[null,null,"Basic sensitivity analysis using summary parameters"]
[]
[null,null,"Economic Rate of Return (ERR)",null,null,null,null,"Net Present Value (NPV), millions US$"]
[null,null,"Column1","80% Benefits","100% Benefits","120% Benefits",null,"Column1","80% Benefits","100% Benefits","120% Benefits"]
[null,null,"80% Costs",0.126,0.189,0.24299999999999999,null,"80% Costs",11.9,46.3,80.7]
[null,null,"100% Costs",9.1999999999999998E-2,0.14899999999999999,0.19700000000000001,null,"100% Costs",-4.5,29.9,64.3]
[null,null,"120% Costs",6.6000000000000003E-2,0.11899999999999999,0.16400000000000001,null,"120% Costs",-20.9,13.5,47.9]
{"$rows_left_out":351}