{"text_format":"1","workbook":"xlsx","n_sheets":12,"sheets":["User's Guide","Activity Description","ERR & Sensitivity Analysis","ERR","Assumptions","Costs","Savings","Health","Commercial","Beneficiaries","Poverty Scorecard","Sensitivity"],"not_rendered":{"charts":2,"images":13,"macros":1,"external_links":0,"defined_names":36,"comments":0,"pivot_tables":0},"unopened":[],"bounds":{"document_bytes":16777216,"sheet_cells":100000,"rows_first":2000,"rows_last":500,"rows_between":2000,"halvings":0,"cell_chars":16384,"cell_head_chars":4096},"cells_cut":0,"cells_raw":0,"read":"whole","date_system":"1900"}

{"sheet":"User's Guide","index":0,"n_rows":54,"n_cols":4,"rows_kept":54,"cut":false,"hidden":false,"merged":[[50,1,50,3],[23,1,23,3],[26,1,26,3],[12,1,16,1],[1,2,4,3],[5,2,6,3]]}
[]
[null,null,"Tanzania: Water Sector Project"]
[]
[]
[]
[null,null,"Morogoro Water Supply Activity"]
[]
[]
[null,"ERR Version","Original ERR","Closeout ERR"]
[null,"Date of ERR","2007-08-24","2016-02-08"]
{"$rows_left_out":45}
{"sheet":"Activity Description","index":1,"n_rows":46,"n_cols":2,"rows_kept":46,"cut":false,"hidden":false,"merged":[]}
[]
[null,"Tanzania: Water Sector Project"]
[]
[null,"Morogoro Water Supply Activity"]
[]
[null,"Activity Design History"]
[]
[null,"Original Project"]
[]
[null,"Tanzania faces a serious shortage of access to potable water, resulting in a high incidence of water-related diseases, decreased workforce productivity, and constrained business growth. The Morogoro Water Activity includes investments in bulk water supply for the Morogoro municipal water system, which will increase the quantity and reliability of potable water for domestic and commercial use."]
{"$rows_left_out":37}
{"sheet":"ERR & Sensitivity Analysis","index":2,"n_rows":34,"n_cols":9,"rows_kept":34,"cut":false,"hidden":false,"merged":[[20,1,20,6],[58,2,58,6],[5,1,5,6],[7,1,8,1],[7,2,8,2],[7,3,7,6]]}
[]
[null,"Tanzania:  Morogoro Water Supply Activity",null,null,null,"Last updated:  2/8/2016"]
[]
[null,"ERR and sensitivity analysis"]
[]
[null,"Change the \"User Input\" cells in the table below to see the effect on the compact's Economic Rate of Return (ERR) and net benefits (see chart below).  To reset all values to the default MCC estimates, click the \"Reset Parameters\" button at right.  Be sure to reset all summary parameters to their original values (\"MCC Estimate\" values) before changing specific parameters."]
[]
[null,"Parameter type","Description of key parameters","Parameter values"]
[null,null,null,"User Input","MCC Estimate","Plausible range","Values used in ERR computation",null,"All summary parameters set to initial values?"]
[null,"Summary","Actual costs as a percentage of estimated costs",1,1,"80 - 120%",{"$f":"D10","v":1},null,{"$f":"IF(D10=E10,IF(D11=E11,\"Y\",\"N\"),\"N\")","v":"Y"}]
{"$rows_left_out":25}
{"sheet":"ERR","index":3,"n_rows":53,"n_cols":30,"rows_kept":53,"cut":false,"hidden":false,"merged":[[49,2,49,10]]}
[null,"Tanzania:  Morogoro Water Supply Activity",null,null,null,null,null,null,null,"Last updated: 2/8/2016"]
[null,"Cost-Benefit Summary"]
[]
[null,null,null,null,{"$f":"IF('ERR & Sensitivity Analysis'!$I$10=\"N\",\"Note: Current calculations are based on user input and are not the original MCC estimates.\",IF('ERR & Sensitivity Analysis'!$I$13=\"N\",\"Note: Current calculations are based on user input and are not the original MCC estimates.\",\"\"))","v":""}]
[null,null,null,null,"All figures in millions of US$",2008,2009,2010,2011,2012,2013,2014,2015,2016,2017,2018,2019,2020,2021,2022,2023,2024,2025,2026,2027,2028]
[null,null,null,null,"Year",0,1,2,3,4,5,6,7,8,9,10,11,12,13,14,15,16,17,18,19,20]
[null,null,"Costs"]
[]
[null,null,null,null,"Disbursement rate",{"$f":"SUM(G9:K9)","v":1},0,0,0.39,0.32,{"$f":"1-SUM(G9:J9)","v":0.29000000000000004},null,null,null,null,null,null,null,null,null,null,null,null,null,null,null,null,null,"Present Value","% of Costs"]
[]
{"$rows_left_out":44}
{"sheet":"Assumptions","index":4,"n_rows":105,"n_cols":14,"rows_kept":105,"cut":false,"hidden":false,"merged":[]}
[null,"Tanzania:  Morogoro Water Supply Activity",null,null,null,null,null,null,null,"Last updated: 2/8/2016"]
[null,"Consumer Profile & Assumptions"]
[]
[null,{"$f":"IF('ERR & Sensitivity Analysis'!$I$10=\"N\",\"Note: Current calculations are based on user input and are not the original MCC estimates.\",IF('ERR & Sensitivity Analysis'!$I$13=\"N\",\"Note: Current calculations are based on user input and are not the original MCC estimates.\",\"\"))","v":""}]
[]
[null,"Without Project",null,null,null,null,null,null,null,null,null,"Household Treatment Costs"]
[null,null,null,null,null,null,null,null,null,null,{"$f":"A74","v":8},"Volume treated (liters/capita/day)",{"$f":"'ERR & Sensitivity Analysis'!G13","v":3}]
[{"$f":"A67","v":1},"Primary drinking water source","% of HH","Liters / capita / day (lpcpd)","Cost of water (Tsh/liter)","% of water treated","Treatment cost (Tsh/liter)","Total cost (Tsh/liter)",null,null,null,"Cost of boiling water","Column1"]
[null,"Own tap",0.52,103.5,{"$f":"M28/1000","v":0.75},{"$f":"M7/Table4[[#This Row],[Liters / capita / day (lpcpd)]]","v":2.8985507246376812E-2},{"$f":"SUMPRODUCT(C16:G16,C$21:G$21)","v":15.967041789124641},{"$f":"Table4[[#This Row],[Cost of water (Tsh/liter)]]+(Table4[[#This Row],[% of water treated]]*Table4[[#This Row],[Treatment cost (Tsh/liter)]])","v":1.2128128054818736},null,null,{"$f":"A76","v":9},"Average annual temperature in Morogoro (Co)",23.9]
[null,"Other piped",0.39,5.5,{"$f":"M28/1000","v":0.75},{"$f":"M7/Table4[[#This Row],[Liters / capita / day (lpcpd)]]","v":0.54545454545454541},{"$f":"SUMPRODUCT(C17:G17,C$21:G$21)","v":7.9743240900587482},{"$f":"Table4[[#This Row],[Cost of water (Tsh/liter)]]+(Table4[[#This Row],[% of water treated]]*Table4[[#This Row],[Treatment cost (Tsh/liter)]])","v":5.0996313218502261},null,null,{"$f":"A78","v":10},"Energy required to boil 1 liter water in Morogoro (kcal)",{"$f":"100-M9","v":76.099999999999994}]
{"$rows_left_out":96}
{"sheet":"Costs","index":5,"n_rows":30,"n_cols":11,"rows_kept":30,"cut":false,"hidden":false,"merged":[]}
[null,"Tanzania:  Morogoro Water Supply Activity",null,null,null,null,null,null,null,null,"Last updated: 2/8/2016"]
[null,"Costs"]
[null,{"$f":"IF('ERR & Sensitivity Analysis'!$I$10=\"N\",\"Note: Current calculations are based on user input and are not the original MCC estimates.\",IF('ERR & Sensitivity Analysis'!$I$13=\"N\",\"Note: Current calculations are based on user input and are not the original MCC estimates.\",\"\"))","v":""}]
[]
[{"$f":"A27","v":1},"Investment costs (US$)","MCA-T","GoT","Total"]
[null,"Capital costs",10365042.322999999,3282843.0290069999,{"$f":"SUM(C6:D6)","v":13647885.352006998}]
[null,"Supervision",2085839.54,775407.6,2861247.14]
[null,"Feasibility studies",95617,0,95617]
[null,"Technical assistance",793879.05,0,793879.05]
[null,"Administrative costs",566833.24979600275,0,566833.24979600275]
{"$rows_left_out":21}
{"sheet":"Savings","index":6,"n_rows":52,"n_cols":26,"rows_kept":52,"cut":false,"hidden":false,"merged":[]}
[null,"Tanzania:  Morogoro Water Supply Activity",null,null,null,null,null,null,null,"Last updated: 2/8/2016"]
[null,"User Cost Savings Benefits"]
[null,null,null,null,{"$f":"IF('ERR & Sensitivity Analysis'!$I$10=\"N\",\"Note: Current calculations are based on user input and are not the original MCC estimates.\",IF('ERR & Sensitivity Analysis'!$I$13=\"N\",\"Note: Current calculations are based on user input and are not the original MCC estimates.\",\"\"))","v":""}]
[]
[null,null,null,null,"All figures in 2014 US$ unless specified",2008,2009,2010,2011,2012,2013,2014,2015,2016,2017,2018,2019,2020,2021,2022,2023,2024,2025,2026,2027,2028]
[null,null,null,null,"Year",0,1,2,3,4,5,6,7,8,9,10,11,12,13,14,15,16,17,18,19,20]
[null,null,null,null,"Benefits?",0,0,0,0,0,0,1,1,1,1,1,1,1,1,1,1,1,1,1,1,1]
[null,null,"Affected Population",null,null,{"$f":"Beneficiaries!L13","v":249492.42453862631},{"$f":"Beneficiaries!M13","v":257768.12788471687},{"$f":"Beneficiaries!N13","v":266318.33762513642},{"$f":"Beneficiaries!O13","v":275152.15918058169},{"$f":"Beneficiaries!P13","v":284279},{"$f":"Beneficiaries!Q13","v":293708.57957891445},{"$f":"Beneficiaries!R13","v":303450.9398100581},{"$f":"Beneficiaries!S13","v":313516.45567734097},{"$f":"Beneficiaries!T13","v":323915.84630453709},{"$f":"Beneficiaries!U13","v":334660.1863704584},{"$f":"Beneficiaries!V13","v":345760.91790277197},{"$f":"Beneficiaries!W13","v":357229.86246301979},{"$f":"Beneficiaries!X13","v":369079.23373581766},{"$f":"Beneficiaries!Y13","v":381321.65053563984},{"$f":"Beneficiaries!Z13","v":393970.15024504083},{"$f":"Beneficiaries!AA13","v":407038.2026986251},{"$f":"Beneficiaries!AB13","v":420539.72452755016},{"$f":"Beneficiaries!AC13","v":434489.09397983924},{"$f":"Beneficiaries!AD13","v":448901.16623228602},{"$f":"Beneficiaries!AE13","v":463791.28921025776},{"$f":"Beneficiaries!AF13","v":479175.31993224367}]
[null,null,"Affected Households",null,null,{"$f":"Beneficiaries!L22","v":58021.494078750307},{"$f":"Beneficiaries!M22","v":59946.076252259743},{"$f":"Beneficiaries!N22","v":61934.497122124754},{"$f":"Beneficiaries!O22","v":63988.874228042252},{"$f":"Beneficiaries!P22","v":66111.395348837206},{"$f":"Beneficiaries!Q22","v":68304.32083230569},{"$f":"Beneficiaries!R22","v":70569.986002339094},{"$f":"Beneficiaries!S22","v":72910.803645893247},{"$f":"Beneficiaries!T22","v":75329.266582450495},{"$f":"Beneficiaries!U22","v":77827.950318711257},{"$f":"Beneficiaries!V22","v":80409.515791342317},{"$f":"Beneficiaries!W22","v":83076.712200702284},{"$f":"Beneficiaries!X22","v":85832.379938562255},{"$f":"Beneficiaries!Y22","v":88679.453612939498},{"$f":"Beneficiaries!Z22","v":91620.965173265315},{"$f":"Beneficiaries!AA22","v":94660.047139215138},{"$f":"Beneficiaries!AB22","v":97799.93593663958},{"$f":"Beneficiaries!AC22","v":101043.97534414867},{"$f":"Beneficiaries!AD22","v":104395.62005402001},{"$f":"Beneficiaries!AE22","v":107858.43935122274},{"$f":"Beneficiaries!AF22","v":111436.12091447528}]
[]
{"$rows_left_out":43}
{"sheet":"Health","index":7,"n_rows":118,"n_cols":26,"rows_kept":118,"cut":false,"hidden":false,"merged":[]}
[null,"Tanzania:  Morogoro Water Supply Activity",null,null,null,null,null,null,null,"Last updated: 2/8/2016"]
[null,"Health Benefits"]
[null,null,null,null,{"$f":"IF('ERR & Sensitivity Analysis'!$I$10=\"N\",\"Note: Current calculations are based on user input and are not the original MCC estimates.\",IF('ERR & Sensitivity Analysis'!$I$13=\"N\",\"Note: Current calculations are based on user input and are not the original MCC estimates.\",\"\"))","v":""}]
[]
[null,null,null,null,"All figures in 2014 US$ unless specified",2008,2009,2010,2011,2012,2013,2014,2015,2016,2017,2018,2019,2020,2021,2022,2023,2024,2025,2026,2027,2028]
[null,null,null,null,"Year",0,1,2,3,4,5,6,7,8,9,10,11,12,13,14,15,16,17,18,19,20]
[null,null,null,null,"Benefits?",0,0,0,0,0,0,{"$f":"IF(1/Assumptions!$N$53+K7<=1, 1/Assumptions!$N$53+K7, 1)","v":0.33333333333333331},{"$f":"IF(1/Assumptions!$N$53+L7<=1, 1/Assumptions!$N$53+L7, 1)","v":0.66666666666666663},{"$f":"IF(1/Assumptions!$N$53+M7<=1, 1/Assumptions!$N$53+M7, 1)","v":1},{"$f":"IF(1/Assumptions!$N$53+N7<=1, 1/Assumptions!$N$53+N7, 1)","v":1},{"$f":"IF(1/Assumptions!$N$53+O7<=1, 1/Assumptions!$N$53+O7, 1)","v":1},{"$f":"IF(1/Assumptions!$N$53+P7<=1, 1/Assumptions!$N$53+P7, 1)","v":1},{"$f":"IF(1/Assumptions!$N$53+Q7<=1, 1/Assumptions!$N$53+Q7, 1)","v":1},{"$f":"IF(1/Assumptions!$N$53+R7<=1, 1/Assumptions!$N$53+R7, 1)","v":1},{"$f":"IF(1/Assumptions!$N$53+S7<=1, 1/Assumptions!$N$53+S7, 1)","v":1},{"$f":"IF(1/Assumptions!$N$53+T7<=1, 1/Assumptions!$N$53+T7, 1)","v":1},{"$f":"IF(1/Assumptions!$N$53+U7<=1, 1/Assumptions!$N$53+U7, 1)","v":1},{"$f":"IF(1/Assumptions!$N$53+V7<=1, 1/Assumptions!$N$53+V7, 1)","v":1},{"$f":"IF(1/Assumptions!$N$53+W7<=1, 1/Assumptions!$N$53+W7, 1)","v":1},{"$f":"IF(1/Assumptions!$N$53+X7<=1, 1/Assumptions!$N$53+X7, 1)","v":1},{"$f":"IF(1/Assumptions!$N$53+Y7<=1, 1/Assumptions!$N$53+Y7, 1)","v":1}]
[null,null,"Affected Population",null,null,{"$f":"Beneficiaries!L13","v":249492.42453862631},{"$f":"Beneficiaries!M13","v":257768.12788471687},{"$f":"Beneficiaries!N13","v":266318.33762513642},{"$f":"Beneficiaries!O13","v":275152.15918058169},{"$f":"Beneficiaries!P13","v":284279},{"$f":"Beneficiaries!Q13","v":293708.57957891445},{"$f":"Beneficiaries!R13","v":303450.9398100581},{"$f":"Beneficiaries!S13","v":313516.45567734097},{"$f":"Beneficiaries!T13","v":323915.84630453709},{"$f":"Beneficiaries!U13","v":334660.1863704584},{"$f":"Beneficiaries!V13","v":345760.91790277197},{"$f":"Beneficiaries!W13","v":357229.86246301979},{"$f":"Beneficiaries!X13","v":369079.23373581766},{"$f":"Beneficiaries!Y13","v":381321.65053563984},{"$f":"Beneficiaries!Z13","v":393970.15024504083},{"$f":"Beneficiaries!AA13","v":407038.2026986251},{"$f":"Beneficiaries!AB13","v":420539.72452755016},{"$f":"Beneficiaries!AC13","v":434489.09397983924},{"$f":"Beneficiaries!AD13","v":448901.16623228602},{"$f":"Beneficiaries!AE13","v":463791.28921025776},{"$f":"Beneficiaries!AF13","v":479175.31993224367}]
[null,null,null,"Age < 5",null,{"$f":"Beneficiaries!L14","v":36425.893982639442},{"$f":"Beneficiaries!M14","v":37634.146671168659},{"$f":"Beneficiaries!N14","v":38882.477293269912},{"$f":"Beneficiaries!O14","v":40172.215240364923},{"$f":"Beneficiaries!P14","v":41504.733999999997},{"$f":"Beneficiaries!Q14","v":42881.452618521507},{"$f":"Beneficiaries!R14","v":44303.837212268481},{"$f":"Beneficiaries!S14","v":45773.402528891776},{"$f":"Beneficiaries!T14","v":47291.713560462413},{"$f":"Beneficiaries!U14","v":48860.387210086919},{"$f":"Beneficiaries!V14","v":50481.094013804701},{"$f":"Beneficiaries!W14","v":52155.559919600884},{"$f":"Beneficiaries!X14","v":53885.568125429374},{"$f":"Beneficiaries!Y14","v":55672.960978203417},{"$f":"Beneficiaries!Z14","v":57519.641935775959},{"$f":"Beneficiaries!AA14","v":59427.57759399926},{"$f":"Beneficiaries!AB14","v":61398.799781022317},{"$f":"Beneficiaries!AC14","v":63435.407721056523},{"$f":"Beneficiaries!AD14","v":65539.570269913762},{"$f":"Beneficiaries!AE14","v":67713.528224697628},{"$f":"Beneficiaries!AF14","v":69959.596710107566}]
[null,null,null,"Age 5-18",null,{"$f":"Beneficiaries!L15","v":66614.477351813228},{"$f":"Beneficiaries!M15","v":68824.090145219408},{"$f":"Beneficiaries!N15","v":71106.996145911427},{"$f":"Beneficiaries!O15","v":73465.626501215316},{"$f":"Beneficiaries!P15","v":75902.493000000002},{"$f":"Beneficiaries!Q15","v":78420.190747570159},{"$f":"Beneficiaries!R15","v":81021.400929285519},{"$f":"Beneficiaries!S15","v":83708.893665850046},{"$f":"Beneficiaries!T15","v":86485.530963311408},{"$f":"Beneficiaries!U15","v":89354.269760912401},{"$f":"Beneficiaries!V15","v":92318.165080040126},{"$f":"Beneficiaries!W15","v":95380.373277626291},{"$f":"Beneficiaries!X15","v":98544.155407463317},{"$f":"Beneficiaries!Y15","v":101812.88069301585},{"$f":"Beneficiaries!Z15","v":105190.03011542591},{"$f":"Beneficiaries!AA15","v":108679.20012053291},{"$f":"Beneficiaries!AB15","v":112284.10644885591},{"$f":"Beneficiaries!AC15","v":116008.58809261708},{"$f":"Beneficiaries!AD15","v":119856.61138402038},{"$f":"Beneficiaries!AE15","v":123832.27421913882},{"$f":"Beneficiaries!AF15","v":127939.81042190906}]
{"$rows_left_out":109}
{"sheet":"Commercial","index":8,"n_rows":32,"n_cols":26,"rows_kept":32,"cut":false,"hidden":false,"merged":[]}
[null,"Tanzania:  Morogoro Water Supply Activity",null,null,null,null,null,null,null,"Last updated: 2/8/2016"]
[null,"Water Flow & Commercial Consumption"]
[]
[null,null,null,null,{"$f":"IF('ERR & Sensitivity Analysis'!$I$10=\"N\",\"Note: Current calculations are based on user input and are not the original MCC estimates.\",IF('ERR & Sensitivity Analysis'!$I$13=\"N\",\"Note: Current calculations are based on user input and are not the original MCC estimates.\",\"\"))","v":""}]
[null,null,null,null,"All figures in 2014 US$ unless specified",2008,2009,2010,2011,2012,2013,2014,2015,2016,2017,2018,2019,2020,2021,2022,2023,2024,2025,2026,2027,2028]
[null,null,null,null,"Year",0,1,2,3,4,5,6,7,8,9,10,11,12,13,14,15,16,17,18,19,20]
[null,null,"Without Project"]
[]
[null,null,"Water produced by MORUWASA (m3)",null,null,{"$f":"cap_wop*365*(1-(nrw*techloss))","v":5361120},5361120,5361120,5361120,5361120,5361120,5361120,5361120,5361120,5361120,5361120,5361120,5361120,5361120,5361120,5361120,5361120,5361120,5361120,5361120,5361120]
[]
{"$rows_left_out":23}
{"sheet":"Beneficiaries","index":9,"n_rows":34,"n_cols":32,"rows_kept":34,"cut":false,"hidden":false,"merged":[]}
[null,"Tanzania: Morogoro Water Supply Activity",null,null,null,null,null,null,null,null,null,null,null,null,null,null,null,"Last updated: 2/8/2016"]
[null,"Beneficiary Estimates"]
[]
[]
[null,null,null,null,null,null,null,null,null,null,null,2008,2009,2010,2011,2012,2013,2014,2015,2016,2017,2018,2019,2020,2021,2022,2023,2024,2025,2026,2027,2028]
[null,null,null,null,"Year",null,null,null,null,null,null,0,1,2,3,4,5,6,7,8,9,10,11,12,13,14,15,16,17,18,19,20]
[null,null,"Tanzania Population",null,null,null,null,null,null,null,null,null,null,null,null,"2012 Census"]
[null,null,"Region",null,"Growth rate","2002 Census",2003,2004,2005,2006,2007]
[null,{"$f":"C31","v":1},"Tanzania Total",null,2.7E-2,34443603,{"$f":"F9*(1+$E9)","v":35373580.280999996},36328666.948586993,37309540.956198841,38316898.562016204,{"$f":"J9*(1+$E9)","v":39351454.823190637},40413944.103416778,41505120.59420903,42625758.850252673,43776654.33920949,44928923,{"$f":"P9*(1+$E9)","v":46142003.920999996},{"$f":"Q9*(1+$E9)","v":47387838.026866995},48667309.6535924,49981327.014239393,51330822.843623854,52716755.060401693,54140107.447032534,55601890.348102406,57103141.387501165,58644926.204963692,60228339.212497704,61854504.37123514,63524575.989258483,65239739.540968455,67001212.508574598,68810245.246306106]
[null,{"$f":"C31","v":1},"Morogoro Region",null,2.4E-2,1753362,1795442.6880000001,1838533.3125120001,1882658.1120122881,1927841.9067005829,1974110.112461397,2021488.7551604705,2070004.4852843219,2119684.5929311458,2170557.0231614932,2218492,2271735.8080000002,2326257.4673920004,2382087.6466094083,2439257.750128034,2497799.9361311067,2557747.1345982533,2619133.0658286116,2681992.2594084982,2746360.0736343022,2812272.7154015256,2879767.2605711622,2948881.6748248702,3019654.8350206669,3092126.5510611632,3166337.5882866313,3242329.6904055104]
{"$rows_left_out":25}
{"sheet":"Poverty Scorecard","index":10,"n_rows":50,"n_cols":19,"rows_kept":50,"cut":false,"hidden":false,"merged":[[34,18,38,18],[3,1,3,8],[4,2,4,7],[6,1,6,7],[7,1,7,7],[13,4,13,7],[25,18,29,18]]}
[null,0,null,null,null,null,null,null,null,null,"Last updated: 2/8/2016"]
[]
[]
[null,"Poverty Scorecard"]
[]
[]
[null,"Tanzania: Morogoro Water Supply Activity"]
[null,null,null,null,null,null,null,null,null,null,"Bar Chart Data"]
[null,null,"2013 US$",null,"2005 PPP $",null,null,null,null,null,"Activity/Sub-activity","Morogoro Water Activity","National Income Distribution"]
[null,"MCC Cost (Millions US$)",{"$f":"Costs!C13/10^6","v":14.34693748210794},null,{"$f":"C10*(99.991/106.442)","v":13.477430203993302},null,null,null,null,null,"Consump. <$1.25/day",{"$f":"E33","v":1.104604489586058E-2},{"$f":"R18","v":0.12758791923351906}]
{"$rows_left_out":41}
{"sheet":"Sensitivity","index":11,"n_rows":362,"n_cols":11,"rows_kept":362,"cut":false,"hidden":false,"merged":[]}
[null,"Tanzania:  Morogoro Water Supply Activity",null,null,null,null,null,null,null,"Last updated: 2/8/2016"]
[null,"Sensitivity Analysis"]
[]
[null,null,"Basic sensitivity analysis using summary parameters"]
[]
[null,null,"Economic Rate of Return (ERR)",null,null,null,null,"Net Present Value (NPV), millions US$"]
[null,null,"Column1","80% Benefits","100% Benefits","120% Benefits",null,"Column1","80% Benefits","100% Benefits","120% Benefits"]
[null,null,"80% Costs",-5.8999999999999997E-2,0.06,0.13400000000000001,null,"80% Costs",-7.5,-2.5,2.5]
[null,null,"100% Costs",-0.08,3.2000000000000001E-2,9.9000000000000005E-2,null,"100% Costs",-10,-5.0999999999999996,-0.1]
[null,null,"120% Costs",-9.7000000000000003E-2,0.01,7.2999999999999995E-2,null,"120% Costs",-12.6,-7.6,-2.6]
{"$rows_left_out":352}