{"text_format":"1","workbook":"xlsx","n_sheets":16,"sheets":["User's Guide","Activity description","CB_DATA_","ERR & Sensitivity Analysis","Assumptions","ERR","Costs","Aircraft","Safety","Tourism","Demand","Arrivals","Sensitivity","Beneficiaries","Poverty Scorecard","References"],"not_rendered":{"charts":6,"images":10,"macros":1,"external_links":0,"defined_names":52,"comments":0,"pivot_tables":0},"unopened":[{"sheet":"Arrivals","index":11,"reason":"not_a_worksheet"}],"bounds":{"document_bytes":16777216,"sheet_cells":100000,"rows_first":2000,"rows_last":500,"rows_between":2000,"halvings":0,"cell_chars":16384,"cell_head_chars":4096},"cells_cut":0,"cells_raw":0,"read":"whole","date_system":"1900"}

{"sheet":"User's Guide","index":0,"n_rows":61,"n_cols":4,"rows_kept":61,"cut":false,"hidden":false,"merged":[[57,1,57,3],[1,2,5,2],[21,1,21,3],[24,1,24,3],[27,1,27,3],[30,1,30,3],[11,1,13,1]]}
[null,null,null,"Last updated: 8/27/2014"]
[null,null,"Tanzania: Mafia Island Airport"]
[]
[]
[]
[]
[]
[null,"ERR Version","Original ERR","Closeout ERR"]
{"$rows_left_out":54}
{"sheet":"Activity description","index":1,"n_rows":41,"n_cols":2,"rows_kept":41,"cut":false,"hidden":false,"merged":[]}
[]
[null,"Tanzania: Transport Sector Project"]
[]
[null,"Mafia Island Airport Rehabilitation"]
[]
[null,"Activity Design History"]
[]
[null,"Original Project"]
{"$rows_left_out":34}
{"sheet":"CB_DATA_","index":2,"n_rows":28,"n_cols":3,"rows_kept":28,"cut":false,"hidden":true,"merged":[]}
["Crystal Ball Data"]
[]
["Workbook Variables","Last Var Column",0]
["    Name:"]
["    Value:"]
[]
["Worksheet Data","Last Data Column Used"]
[null,3]
{"$rows_left_out":21}
{"sheet":"ERR & Sensitivity Analysis","index":3,"n_rows":32,"n_cols":9,"rows_kept":32,"cut":false,"hidden":false,"merged":[[18,1,18,6],[1,5,1,7],[1,1,1,2],[3,1,3,2],[5,1,5,6],[7,1,8,1],[7,2,8,2],[7,3,7,6]]}
[]
[null,"Tanzania: Mafia Island Airport"]
[]
[null,"ERR and sensitivity analysis",null,null,null,null,"Last updated:  8/27/2014"]
[]
[null,"Change the \"User Input\" cells in the table below to see the effect on the compact's Economic Rate of Return (ERR) and net benefits (see chart below).  To reset all values to the default MCC estimates, click the \"Reset Parameters\" button at right.  Be sure to reset all summary parameters to their original values (\"MCC Estimate\" values) before changing specific parameters."]
[]
[null,"Parameter type","Description of key parameters","Parameter values"]
{"$rows_left_out":25}
{"sheet":"Assumptions","index":4,"n_rows":54,"n_cols":5,"rows_kept":54,"cut":false,"hidden":false,"merged":[[1,1,1,2],[36,1,36,4],[37,1,37,4],[38,1,38,4],[49,1,49,4],[39,1,39,4],[41,1,41,4],[44,1,44,4],[46,1,46,4],[47,1,47,4],[2,2,2,4]]}
[null,"Tanzania: Mafia Island Airport",null,null,"Last updated:  8/27/2014"]
[null,"Assumptions"]
[null,null,{"$f":"IF('ERR & Sensitivity Analysis'!$I$10=\"N\",\"Note: Current calculations are based on user input and are not the original MCC estimates.\",IF('ERR & Sensitivity Analysis'!$I$14=\"N\",\"Note: Current calculations are based on user input and are not the original MCC estimates.\",0))","v":0}]
[null,"*  all prices are in 2013 US$ unless otherwise noted"]
[]
[null,"Value","Assumption","Source","Note"]
[null,{"$f":"'ERR & Sensitivity Analysis'!G17","v":5.0000000000000001E-3},"Increased annual airport O&M costs as a percentage of investment costs","Assumption",{"$f":"A36","v":1}]
[]
{"$rows_left_out":47}
{"sheet":"ERR","index":5,"n_rows":68,"n_cols":26,"rows_kept":68,"cut":false,"hidden":false,"merged":[[1,2,1,5],[0,2,0,6]]}
[null,"Tanzania: Mafia Island Airport",{"$f":"IF('ERR & Sensitivity Analysis'!$I$10=\"N\",\"Note: Current calculations are based on user input and are not the original MCC estimates.\",IF('ERR & Sensitivity Analysis'!$I$14=\"N\",\"Note: Current calculations are based on user input and are not the original MCC estimates.\",0))","v":0},null,null,null,null,null,"Last updated:  8/27/2014"]
[null,"ERR Summary","<--------------------- Compact Period ---------------------->"]
[null,"Project year",0,1,2,3,4,5,6,7,8,9,10,11,12,13,14,15,16,17,18,19,20]
["Notes","Year",2010,2011,2012,2013,2014,2015,2016,2017,2018,2019,2020,2021,2022,2023,2024,2025,2026,2027,2028,2029,2030]
[]
[{"$f":"A61","v":1},"Costs"]
[null,"Construction costs",{"$f":"Costs!I8","v":0},{"$f":"Costs!J8","v":0},{"$f":"Costs!K8","v":3410204.78},{"$f":"Costs!L8","v":7642163.1699999999},{"$f":"Costs!M8","v":20000}]
[null,"Supervision",{"$f":"Costs!I9","v":0},{"$f":"Costs!J9","v":285000},{"$f":"Costs!K9","v":645000},{"$f":"Costs!L9","v":740175},{"$f":"Costs!M9","v":315468}]
{"$rows_left_out":61}
{"sheet":"Costs","index":6,"n_rows":22,"n_cols":14,"rows_kept":22,"cut":false,"hidden":false,"merged":[[2,2,2,10],[5,13,6,13],[5,1,6,1],[5,2,6,2],[5,3,6,3],[5,4,6,4]]}
[null,"Tanzania: Mafia Island Airport",null,null,null,null,null,null,null,null,null,"Last updated:  8/27/2014"]
[null,"Activity Costs"]
[null,null,{"$f":"IF('ERR & Sensitivity Analysis'!$I$10=\"N\",\"Note: Current calculations are based on user input and are not the original MCC estimates.\",IF('ERR & Sensitivity Analysis'!$I$14=\"N\",\"Note: Current calculations are based on user input and are not the original MCC estimates.\",0))","v":0}]
[{"$f":"A21","v":1},"Activity costs by funder",null,null,null,null,"Activity costs per year"]
[]
[null,"Component","MCA-T","GoT","Total",null,"Compact year","Y1","Y2","Y3","Y4","Y5","Y6","Total"]
[null,null,null,null,null,null,"Year",2009,2010,2011,2012,2013,2014]
[null,"Construction costs",11052367.949999999,20000,11072367.949999999,null,"Construction costs",null,null,null,{"$f":"'ERR & Sensitivity Analysis'!G10*3410204.78","v":3410204.78},{"$f":"'ERR & Sensitivity Analysis'!G10*7642163.17","v":7642163.1699999999},{"$f":"'ERR & Sensitivity Analysis'!G10*20000","v":20000},{"$f":"SUM(H8:M8)","v":11072367.949999999}]
{"$rows_left_out":15}
{"sheet":"Aircraft","index":7,"n_rows":51,"n_cols":27,"rows_kept":51,"cut":false,"hidden":false,"merged":[[1,4,1,7],[0,2,0,6]]}
[null,"Tanzania: Mafia Island Airport",{"$f":"IF('ERR & Sensitivity Analysis'!$I$10=\"N\",\"Note: Current calculations are based on user input and are not the original MCC estimates.\",IF('ERR & Sensitivity Analysis'!$I$14=\"N\",\"Note: Current calculations are based on user input and are not the original MCC estimates.\",0))","v":0},null,null,null,null,null,null,null,"Last updated:  8/27/2014"]
[null,"Aircraft Operating Costs",null,null,"<--------------------- Compact Period ---------------------->"]
[null,"Project year",-2,-1,0,1,2,3,4,5,6,7,8,9,10,11,12,13,14,15,16,17,18,19,20]
["Notes","Year",2008,2009,2010,2011,2012,2013,2014,2015,2016,2017,2018,2019,2020,2021,2022,2023,2024,2025,2026,2027,2028,2029,2030]
[null,"Without Project"]
[null,"Inbound flights",{"$f":"Tourism!L6","v":1527},{"$f":"Tourism!M6","v":1526},{"$f":"Tourism!N6","v":1444},{"$f":"Tourism!O6","v":1394},{"$f":"Tourism!P6","v":1462},{"$f":"Tourism!Q6","v":1488.316},{"$f":"Tourism!R6","v":1515.1056880000001},{"$f":"Tourism!S6","v":1542.3775903840001},{"$f":"Tourism!T6","v":1570.140387010912},{"$f":"Tourism!U6","v":1598.4029139771085},{"$f":"Tourism!V6","v":1627.1741664286965},{"$f":"Tourism!W6","v":1656.463301424413},{"$f":"Tourism!X6","v":1686.2796408500524},{"$f":"Tourism!Y6","v":1716.6326743853533},{"$f":"Tourism!Z6","v":1747.5320625242896},{"$f":"Tourism!AA6","v":1778.9876396497268},{"$f":"Tourism!AB6","v":1811.0094171634219},{"$f":"Tourism!AC6","v":1843.6075866723634},{"$f":"Tourism!AD6","v":1876.792523232466},{"$f":"Tourism!AE6","v":1910.5747886506504},{"$f":"Tourism!AF6","v":1944.9651348463622},{"$f":"Tourism!AG6","v":1979.9745072735966},{"$f":"Tourism!AH6","v":2015.6140484045213}]
[null,"Aircraft movements",{"$f":"C6*2","v":3054},{"$f":"D6*2","v":3052},2888,2788,2924,2976.6320000000001,3030.2113760000002,3084.7551807680002,3140.2807740218241,3196.805827954217,3254.348332857393,3312.926602848826,3372.5592817001047,3433.2653487707066,3495.0641250485792,3557.9752792994536,3622.0188343268437,3687.2151733447267,3753.585046464932,3821.1495773013007,3889.9302696927243,3959.9490145471932,4031.2280968090427]
[null,"Inbound flights per day",{"$f":"C6/365","v":4.183561643835616},{"$f":"D6/365","v":4.1808219178082195},3.956164383561644,3.8191780821917809,4.0054794520547947,4.0775780821917813,4.1509744876712329,4.2256920284493154,4.3017544849614024,4.3791860656907078,4.4580114148731411,4.5382556203408573,4.6199442215069926,4.7031032174941183,4.7877590754090127,4.8739387387663751,4.9616696360641699,5.0509796895133245,5.1418973239245647,5.2344514757552068,5.3286716023188001,5.4245876911605384,5.5222302696014287]
{"$rows_left_out":44}
{"sheet":"Safety","index":8,"n_rows":44,"n_cols":27,"rows_kept":44,"cut":false,"hidden":false,"merged":[[1,2,1,7],[0,2,0,6]]}
[null,"Tanzania: Mafia Island Airport",{"$f":"IF('ERR & Sensitivity Analysis'!$I$10=\"N\",\"Note: Current calculations are based on user input and are not the original MCC estimates.\",IF('ERR & Sensitivity Analysis'!$I$14=\"N\",\"Note: Current calculations are based on user input and are not the original MCC estimates.\",0))","v":0},null,null,null,null,null,null,null,null,"Last updated:  8/27/2014"]
[null,"Safety Benefits","<--------------------------    Compact Period    --------------------------->"]
[null,"Project year",-2,-1,0,1,2,3,4,5,6,7,8,9,10,11,12,13,14,15,16,17,18,19,20]
["Notes","Year",2008,2009,2010,2011,2012,2013,2014,2015,2016,2017,2018,2019,2020,2021,2022,2023,2024,2025,2026,2027,2028,2029,2030]
[null,"Without Project"]
[null,"Inbound flights",{"$f":"Tourism!L6","v":1527},{"$f":"Tourism!M6","v":1526},{"$f":"Tourism!N6","v":1444},{"$f":"Tourism!O6","v":1394},{"$f":"Tourism!P6","v":1462},{"$f":"Tourism!Q6","v":1488.316},{"$f":"Tourism!R6","v":1515.1056880000001},{"$f":"Tourism!S6","v":1542.3775903840001},{"$f":"Tourism!T6","v":1570.140387010912},{"$f":"Tourism!U6","v":1598.4029139771085},{"$f":"Tourism!V6","v":1627.1741664286965},{"$f":"Tourism!W6","v":1656.463301424413},{"$f":"Tourism!X6","v":1686.2796408500524},{"$f":"Tourism!Y6","v":1716.6326743853533},{"$f":"Tourism!Z6","v":1747.5320625242896},{"$f":"Tourism!AA6","v":1778.9876396497268},{"$f":"Tourism!AB6","v":1811.0094171634219},{"$f":"Tourism!AC6","v":1843.6075866723634},{"$f":"Tourism!AD6","v":1876.792523232466},{"$f":"Tourism!AE6","v":1910.5747886506504},{"$f":"Tourism!AF6","v":1944.9651348463622},{"$f":"Tourism!AG6","v":1979.9745072735966},{"$f":"Tourism!AH6","v":2015.6140484045213}]
[{"$f":"A39","v":1},"Aircraft movements",{"$f":"C6*2","v":3054},{"$f":"D6*2","v":3052},2888,2788,2924,2976.6320000000001,3030.2113760000002,3084.7551807680002,3140.2807740218241,3196.805827954217,3254.348332857393,3312.926602848826,3372.5592817001047,3433.2653487707066,3495.0641250485792,3557.9752792994536,3622.0188343268437,3687.2151733447267,3753.585046464932,3821.1495773013007,3889.9302696927243,3959.9490145471932,4031.2280968090427]
[null,"Passenger arrivals",{"$f":"Tourism!L10","v":8939},{"$f":"Tourism!M10","v":9523},{"$f":"Tourism!N10","v":9671},{"$f":"Tourism!O10","v":9676},{"$f":"Tourism!P10","v":9733},{"$f":"Tourism!Q10","v":9908.1939999999995},{"$f":"Tourism!R10","v":10086.541492},{"$f":"Tourism!S10","v":10268.099238856001},{"$f":"Tourism!T10","v":10452.925025155409},{"$f":"Tourism!U10","v":10641.077675608207},{"$f":"Tourism!V10","v":10832.617073769155},{"$f":"Tourism!W10","v":11027.604181097},{"$f":"Tourism!X10","v":11226.101056356747},{"$f":"Tourism!Y10","v":11428.170875371168},{"$f":"Tourism!Z10","v":11633.87795112785},{"$f":"Tourism!AA10","v":11843.287754248151},{"$f":"Tourism!AB10","v":12056.466933824619},{"$f":"Tourism!AC10","v":12273.483338633461},{"$f":"Tourism!AD10","v":12494.406038728865},{"$f":"Tourism!AE10","v":12719.305347425985},{"$f":"Tourism!AF10","v":12948.252843679653},{"$f":"Tourism!AG10","v":13181.321394865887},{"$f":"Tourism!AH10","v":13418.585179973474}]
{"$rows_left_out":37}
{"sheet":"Tourism","index":9,"n_rows":42,"n_cols":34,"rows_kept":42,"cut":false,"hidden":false,"merged":[[1,12,1,16],[0,10,0,14]]}
[null,"Tanzania: Mafia Island Airport",null,null,null,null,null,null,null,null,{"$f":"IF('ERR & Sensitivity Analysis'!$I$10=\"N\",\"Note: Current calculations are based on user input and are not the original MCC estimates.\",IF('ERR & Sensitivity Analysis'!$I$11=\"N\",\"Note: Current calculations are based on user input and are not the original MCC estimates.\",0))","v":0},null,null,null,null,null,null,null,null,"Last updated:  8/27/2014"]
[null,"Tourism Benefits",null,null,null,null,null,null,null,null,null,null,"<-------------------------------    Compact Period    --------------------------------->"]
[null,"Project year",-11,-10,-9,-8,-7,-6,-5,-4,-3,-2,-1,0,1,2,3,4,5,6,7,8,9,10,11,12,13,14,15,16,17,18,19,20]
["Notes","Year",1999,2000,2001,2002,2003,2004,2005,2006,2007,2008,2009,2010,2011,2012,2013,2014,2015,2016,2017,2018,2019,2020,2021,2022,2023,2024,2025,2026,2027,2028,2029,2030]
[{"$f":"A39","v":1},"Without project"]
[{"$f":"A40","v":2},"Inbound flights",1290,1504,1614,2130,2133,2413,2448,2131,1373,1527,1526,1444,1394,1462,{"$f":"P6*(1+growth)","v":1488.316},1515.1056880000001,1542.3775903840001,1570.140387010912,1598.4029139771085,1627.1741664286965,1656.463301424413,1686.2796408500524,1716.6326743853533,1747.5320625242896,1778.9876396497268,1811.0094171634219,1843.6075866723634,1876.792523232466,1910.5747886506504,1944.9651348463622,1979.9745072735966,2015.6140484045213]
[null,"Passengers per flight",{"$f":"C10/C6","v":5.1232558139534881},4.7140957446808507,5.2565055762081787,4.208920187793427,4.6765119549929679,4.9879817654372154,4.5371732026143787,4.5997184420459876,4.6270939548434082,{"$f":"L10/L6","v":5.8539620170268503},{"$f":"M10/M6","v":6.2404980340760154},{"$f":"N10/N6","v":6.6973684210526319},6.9411764705882355,6.6573187414500685,6.6573187414500676,6.6573187414500685,6.6573187414500685,6.6573187414500694,6.6573187414500694,6.6573187414500694,6.6573187414500694,6.6573187414500703,6.6573187414500703,6.6573187414500712,6.6573187414500703,6.6573187414500712,6.6573187414500712,6.6573187414500712,6.6573187414500721,6.6573187414500721,6.6573187414500721,6.657318741450073]
[{"$f":"A41","v":3},"Passenger load factor (% of seats filled)",{"$f":"C7/10","v":0.51232558139534878},0.47140957446808507,0.52565055762081792,0.42089201877934268,0.46765119549929679,0.49879817654372155,0.45371732026143785,0.45997184420459875,0.46270939548434081,{"$f":"L7/10","v":0.58539620170268503},{"$f":"M7/12","v":0.52004150283966799},{"$f":"N7/12","v":0.55811403508771928},0.57843137254901966,0.55477656178750567,0.55477656178750567,0.55477656178750567,0.55477656178750567,0.55477656178750578,0.55477656178750578,0.55477656178750578,0.55477656178750578,0.5547765617875059,0.5547765617875059,0.5547765617875059,0.5547765617875059,0.5547765617875059,0.5547765617875059,0.5547765617875059,0.55477656178750601,0.55477656178750601,0.55477656178750601,0.55477656178750612]
{"$rows_left_out":35}
{"sheet":"Demand","index":10,"n_rows":46,"n_cols":18,"rows_kept":46,"cut":false,"hidden":false,"merged":[[25,10,25,12],[25,14,25,16],[2,8,2,16]]}
[null,"Tanzania: Mafia Island Airport",null,null,null,null,null,null,null,null,null,null,null,"Last updated:  8/27/2014"]
[null,"Demand for Flights to Mafia Island"]
[null,null,null,null,null,null,null,null,{"$f":"IF('ERR & Sensitivity Analysis'!$I$10=\"N\",\"Note: Current calculations are based on user input and are not the original MCC estimates.\",IF('ERR & Sensitivity Analysis'!$I$14=\"N\",\"Note: Current calculations are based on user input and are not the original MCC estimates.\",0))","v":0}]
[{"$f":"A42","v":1},{"$f":"120*2","v":240},"Round-trip (DAR-MFA), 2013"]
[{"$f":"A43","v":2},10806,"Passenger arrivals, 2013"]
[3,8.5491437749552688,"Average aircraft operating cost savings per passenger arrival"]
[]
[null,"Estimating the demand equation based on 2013 prices and arrivals"]
{"$rows_left_out":39}
{"sheet":"Sensitivity","index":12,"n_rows":196,"n_cols":23,"rows_kept":196,"cut":false,"hidden":false,"merged":[]}
[null,null,"Tanzania: Mafia Island Airport",null,null,null,null,null,null,null,"Last updated:  8/27/2014"]
[null,null,"Sensitivity Analysis"]
[]
[null,null,null,null,null,null,"Crystal Ball Report - Full"]
[null,null,null,null,null,null,"Simulation started on 8/27/2014 at 5:23 PM"]
[null,null,null,null,null,null,"Simulation stopped on 8/27/2014 at 5:43 PM"]
[]
[null,null,"Run preferences:",null,null,null,null,null,null,null,null,null,"Crystal Ball data:"]
{"$rows_left_out":189}
{"sheet":"Beneficiaries","index":13,"n_rows":25,"n_cols":33,"rows_kept":25,"cut":false,"hidden":false,"merged":[]}
[null,"Tanzania: Mafia Island Airport Activity",null,null,null,null,null,null,null,null,null,null,null,null,null,null,"Last updated: 8/27/2014"]
[null,"Beneficiary Estimates"]
[null,null,null,null,null,null,null,null,null,null,null,null,{"$f":"IF('ERR & Sensitivity Analysis'!$I$10=\"N\",\"Note: Current calculations are based on user input and are not the original MCC estimates.\",IF('ERR & Sensitivity Analysis'!$I$14=\"N\",\"Note: Current calculations are based on user input and are not the original MCC estimates.\",\"\"))","v":""}]
[null,"Tanzania Population",null,null,null,null,null,null,null,null,null,null,"Y0","Y1","Y2","Y3","Y4","Y5","Y6","Y7","Y8","Y9","Y10","Y11","Y12","Y13","Y14","Y15","Y16","Y17","Y18","Y19","Y20"]
[null,"Region",null,"Growth rate","2002 Census",2003,2004,2005,2006,2007,2008,2009,2010,2011,"2012 Census",2013,2014,2015,2016,2017,2018,2019,2020,2021,2022,2023,2024,2025,2026,2027,2028,2029,2030]
[{"$f":"A23","v":1},"Tanzania Total",null,2.7E-2,34443603,{"$f":"E6*(1+$D6)","v":35373580.280999996},36328666.948586993,37309540.956198841,38316898.562016204,{"$f":"I6*(1+$D6)","v":39351454.823190637},40413944.103416778,41505120.59420903,42625758.850252673,43776654.33920949,44928923,{"$f":"O6*(1+$D6)","v":46142003.920999996},47387838.026866995,48667309.6535924,49981327.014239393,51330822.843623854,52716755.060401693,54140107.447032534,55601890.348102406,57103141.387501165,58644926.204963692,60228339.212497704,61854504.37123514,63524575.989258483,65239739.540968455,67001212.508574598,68810245.246306106,{"$f":"AE6*(1+$D6)","v":70668121.86795637},72576161.158391193]
[{"$f":"A24","v":2},"Pwani Region",null,2.1999999999999999E-2,885017,904487.37400000007,924386.09622800013,944722.5903450161,965506.48733260646,986747.63005392381,1008456.0779151102,1030642.1116292427,1053316.238085086,1076489.1953229578,1098668,1122838.696,1147541.1473119999,1172787.052552864,1198588.3677090269,1224957.3117986256,1251906.3726581954,1279448.3128566758,1307596.1757395228,1336363.2916057922,1365763.2840211196,1395810.0762695842,1426517.8979475151,1457901.2917023604,1489975.1201198124,1522754.5727624483,1556255.1733632223,1590492.7871772132,1625483.6284951121]
[{"$f":"A25","v":3},null,"Mafia Island",{"$f":"((O8/E8)^0.1)-1","v":1.363306389575536E-2},40557,{"$f":"E8*(1+$D8)","v":41109.916172420148},41670.370286347897,42238.46510702146,42814.30480068412,43397.994953684189,43989.642591835436,44589.356200041373,45197.24574218713,45813.422681302523,46438,47071.092221191087,47712.815429085582,48363.287290476685,49022.627076316523,49690.955683585737,50368.395657461209,51055.071213786068,51751.108261845955,52456.634427455851,53171.779076361636,53896.673337960659,54631.450129345729,55376.244179676869,56131.192054885352,56896.432182714518,57672.104878101978,58458.35236890785,59255.318821993751]
{"$rows_left_out":18}
{"sheet":"Poverty Scorecard","index":14,"n_rows":50,"n_cols":20,"rows_kept":50,"cut":false,"hidden":false,"merged":[[25,19,29,19],[3,1,3,8],[6,1,6,7],[7,1,7,7],[13,4,13,7],[4,2,4,10]]}
[null,0,null,null,null,null,null,null,null,null,"Last updated: 8/27/2014"]
[]
[]
[null,"Poverty Scorecard"]
[null,null,{"$f":"IF('ERR & Sensitivity Analysis'!$I$10=\"N\",\"Note: Current calculations are based on user input and are not the original MCC estimates.\",IF('ERR & Sensitivity Analysis'!$I$14=\"N\",\"Note: Current calculations are based on user input and are not the original MCC estimates.\",\"\"))","v":""}]
[]
[null,"Tanzania: Mafia Island Airport Activity"]
[null,null,null,null,null,null,null,null,null,null,"Bar Chart Data"]
{"$rows_left_out":43}
{"sheet":"References","index":15,"n_rows":14,"n_cols":4,"rows_kept":14,"cut":false,"hidden":false,"merged":[]}
[null,"Tanzania: Mafia Island Airport",null,"Last updated:  8/27/2014"]
[null,"References"]
[]
[]
[null,"Aircraft Cost Calculator (2014).  Cessna Caravan EX Report. Mequon, WI.  https://www.aircraftcostcalculator.com/media/145737/acc_report_cessna_caravan_operating_costs.pdf. Accessed 8/14/14."]
[null,"Busalama, Abel (2012).  Mafia Island Airport Upgrade Performance Evaluation Baseline Report. Submitted to MCA-Tanzania October 2012."]
[null,"Coastal Aviation. http://www.coastal.co.tz/"]
[null,"Controller.com. 2014 Cessna Grand Caravan EX - new.  http://www.controller.com/listingsdetail/aircraft-for-sale/CESSNA-GRAND-CARAVAN-EX/2013-CESSNA-GRAND-CARAVAN-EX/1278093.htm. Accessed 8/13/14."]
{"$rows_left_out":6}