{"text_format":"1","workbook":"xlsx","n_sheets":14,"sheets":["User's Guide","Activity Description","CB_DATA_","ERR & Sensitivity Analysis","Cost-Benefit Summary","Iden_classe","Don_classe 1","BudExp DHMax<55%","Don_classe2","BudExp DHMax>55%","DATA-enq reference","Data&assumptions","total budget","fruit tree budget"],"not_rendered":{"charts":2,"images":4,"macros":1,"external_links":0,"defined_names":11,"comments":5,"pivot_tables":2},"unopened":[],"bounds":{"document_bytes":16777216,"sheet_cells":100000,"rows_first":2000,"rows_last":500,"rows_between":2000,"halvings":0,"cell_chars":16384,"cell_head_chars":4096},"cells_cut":0,"cells_raw":0,"read":"whole","date_system":"1900"}

{"sheet":"User's Guide","index":0,"n_rows":53,"n_cols":4,"rows_kept":53,"cut":false,"hidden":false,"merged":[[11,1,12,1],[22,1,22,3],[1,2,5,3],[25,1,25,4]]}
[null,null,null,"Last updated: 1/30/2014"]
[null,null,"Morocco: Fruit Tree Productivity Project \nOlive Tree Irrigation and Intensification Activity"]
[]
[]
[]
[]
[]
[null,"ERR Version","Original Activity ERR","Closeout Activity ERR"]
[null,"Date of ERR","2005-07-06","2014-01-30"]
[null,"Amount of MCC funds","$58.42 million","$66.30 million"]
{"$rows_left_out":44}
{"sheet":"Activity Description","index":1,"n_rows":27,"n_cols":2,"rows_kept":27,"cut":false,"hidden":false,"merged":[[4,1,4,3],[6,1,6,2]]}
[null,"Last updated: 1/30/2014"]
[null,"Morocco: Fruit Tree Productivity Project"]
[null,"Olive Tree Irrigation and Intensification Project Activity"]
[]
[null,"Activity Design History"]
[]
[null,"Original Project"]
[null,"Cereal production in Morocco is characterized by low labor intensity and high water intensity, whereby labor is abundant and inexpensive and water is scarce and costly. A comparison of labor inputs used in the production of different crops shows that wheat production more heavily relies on water use than vegetable or olive production, which utilize labor inputs more intensely.  The Fruit Tree Productivity Project will thus help farmers move towards more productive market-oriented cultivation of perennial tree crops (olives, almonds, figs, dates) based on sustainable management of soil and water resources and improved links to national and international markets.                                                                                                                                          "]
[null,"The original Activity was designed to support the intensification/rehabilitation of existing olive tree production in small- and medium-sized irrigated perimeters (\"PMH\"). The primary goal was to increase the efficiency of water-use and other crop practices, such as crop rotation, to enhance the yield and profitability of olive production in the target areas. The activity was originally designed to cover 25,600 ha within perimeters covering 47,000 ha."]
[]
{"$rows_left_out":18}
{"sheet":"CB_DATA_","index":2,"n_rows":0,"n_cols":0,"rows_kept":0,"cut":false,"hidden":true,"merged":[]}

{"sheet":"ERR & Sensitivity Analysis","index":3,"n_rows":68,"n_cols":14,"rows_kept":68,"cut":false,"hidden":false,"merged":[[1,1,1,4],[2,1,2,4],[42,2,42,3],[48,2,48,4],[67,2,67,5],[6,1,6,6],[8,1,9,1],[8,2,9,2],[8,3,8,6]]}
[]
[null,"Morocco: Fruit Tree Productivity"]
[null,"Olive  Tree Irrigation & Intensification"]
[]
[null,"ERR and sensitivity analysis",null,null,null,null,"Last updated: 1/30/2014"]
[]
[null,"Change the \"User Input\" cells in the table below to see the effect on the compact's Economic Rate of Return (ERR) and net benefits (see chart below).  To reset all values to the default MCC estimates, click the \"Reset Parameters\" button at right.  Be sure to reset all summary parameters to their original values (\"MCC Estimate\" values) before changing specific parameters."]
[]
[null,"Parameter type","Description of key parameters","Parameter values"]
[null,null,null,"User Input","MCC Estimate","Plausible Range","Values used in ERR computation ",null,"All summary parameters set to initial values?"]
{"$rows_left_out":59}
{"sheet":"Cost-Benefit Summary","index":4,"n_rows":26,"n_cols":32,"rows_kept":26,"cut":false,"hidden":false,"merged":[[6,0,6,2],[1,1,1,4],[2,1,2,4]]}
[null,{"$f":"IF('ERR & Sensitivity Analysis'!$I$10=\"N\",\"Note: Current calculations are based on user input and are not the original MCC estimates.\",IF('ERR & Sensitivity Analysis'!$J$14=\"N\",\"Note: Current calculations are based on user input and are not the original MCC estimates.\",0))","v":0},null,null,null,null,"Last updated:  1/30/2014"]
[null,"Morocco: Fruit Tree Productivity"]
[null,"Olive  Tree Irrigation & Intensification"]
[]
["Combined ERR"]
[]
[{"$f":"IF('ERR & Sensitivity Analysis'!$I$11=\"Y\",IF('ERR & Sensitivity Analysis'!$I$12=\"Y\",\"\",\"Note: Current calculations are based on user input and are not the original MCC estimates\"),\"Note: Current calculations are based on user input and are not the original MCC estimates\")","v":""}]
[null,null,"Number exploitants"]
[null,"Déficit Hydrique <=55%",{"$f":"+'Data&assumptions'!E60","v":4596.1165048543689},null,null,null,null,null,null,null,null,null,null,null,null,null,null,null,null,null,null,null,null,null,null,null,null,{"$f":"IF('ERR & Sensitivity Analysis'!$I$11=\"y\",IF('ERR & Sensitivity Analysis'!$I$12=\"y\",\"\",\"Note:Current calculations are based on user input and are not the original MCC estimates\"),\"Note:Current calculations are based on user input and are not the original MCC estimates\")","v":""}]
[null,"Déficit Hydrique > 55%",{"$f":"+'Data&assumptions'!E61","v":7589.7832817337458}]
{"$rows_left_out":17}
{"sheet":"Iden_classe","index":5,"n_rows":123,"n_cols":17,"rows_kept":123,"cut":false,"hidden":false,"merged":[]}
[]
[]
["Région","Province","Périmètre","Type","SAU MCA","SAU diagnostic","Number farms","sup oliv","sup palm","AUEA existante","AUEA active","Tranche","Cost project (1000 dh)","CM/Ha","DH Max en Years Avg","Classe","Zone agro-écologique"]
["Meknes-Tafilalet","Khénifra","Chbouka","PMH",120,160,80,56,null,"Adkhsal","crée en  juin",3,2548,15925,-10.34,1,"avgne Montagne"]
["Tadla-Azilal","Azilal","Tabounout","PMH",80,91,50,73,null,"AUEA ","Derniere AG 2006",3,2420,26593.406593406595,-8.27,1,"Haute Montagne"]
["Meknes-Tafilalet","Khénifra","Assaka","PMH",50,182,140,137,null,"AUEA ","dérniere AG 2001",2,3613,19851.648351648349,-0.26,1,"avgne Montagne"]
["Tadla-Azilal","Azilal","Tanaghlemt","PMH",130,77,76,62,null,"AUEA ","en création",3,2585,33571.428571428572,-0.25,1,"Haute Montagne"]
["Tadla-Azilal","Azilal","Ait Ouishane","PMH",60,134,185,86,null,"AUEA ","dérniere AG 2006",3,1635,12201.492537313432,-0.12,1,"Haute Montagne"]
["Meknes-Tafilalet","ERRACHIDIA","RICH","PMH",1520,1739,1085,192,0,"AUEA+JEMAA","BON",2,29988,17244.393329499711,0,1,"Piémont"]
["Tadla-Azilal","Azilal","Askar","PMH",50,184,120,120,null,"AUEA ","En cours constitution",3,2226,12097.826086956522,0.03,1,"Haute Montagne"]
{"$rows_left_out":114}
{"sheet":"Don_classe 1","index":6,"n_rows":127,"n_cols":18,"rows_kept":127,"cut":false,"hidden":false,"merged":[[96,1,96,6],[96,10,96,15],[2,0,2,8],[2,9,2,17],[22,0,22,6],[22,9,22,15],[50,0,50,6],[78,1,78,6],[78,10,78,15]]}
[]
[]
["Area sown_ Actual situation (ha)",null,null,null,null,null,null,null,null,"Area sown_ Situation With project"]
["Crop/Perimeter","Rich","Talsint","Aït Chribou","Ouaoumana","Guers Tiallaline","Total","Assol_Avg/Exp","Assol_Avg/Exp","Crop/Perimeter","Rich","Talsint","Aït Chribou","Ouaoumana","Guers Tiallaline","Total","Assol_Avg/Exp","Assol_Avg/Exp"]
["Olives",192,270,253,640,979,{"$f":"SUM(B5:F5)","v":2334},{"$f":"G5/$G$21","v":0.5652700411721967},{"$f":"+'Data&assumptions'!B142","v":1.6}," Olives",292,470,253,840,979,{"$f":"SUM(K5:O5)","v":2834},{"$f":"P5/$P$21","v":0.68636473722450952},{"$f":"+I5*P5/G5","v":1.9427592116538135}]
["Dates",91,12,null,null,3,{"$f":"SUM(B6:F6)","v":106},2.5672075563090337E-2,{"$f":"+'Data&assumptions'!$B$146*(H6/($H$6+$H$7))","v":0.15306924226696009},"Dates",91,12,null,null,3,{"$f":"SUM(K6:O6)","v":106},{"$f":"P6/$P$21","v":2.5672075563090337E-2},{"$f":"+I6*P6/G6","v":0.15306924226696009}]
["Other Trees,",209,65,null,null,110,384,9.3000726568176317E-2,{"$f":"+'Data&assumptions'!$B$146*(H7/($H$6+$H$7))","v":0.55451499085389311},"Other Trees,",209,65,null,null,110,384,9.3000726568176317E-2,0.55451499085389311]
["Oats",null,0,null,null,null,0,null,null,"Oats",null,0,null,null,null,0]
["Bersim",null,0,null,null,null,0,0,{"$f":"H9/$H$20*$I$20","v":0},"Bersim",null,0,null,null,null,0,0]
["Hard wheat",795,105,null,96,158,1154,0.27948655848873821,{"$f":"+'Data&assumptions'!$C$129*(H10/($H$10+$H$18+$H$11+$H$15))","v":1.2215215530831944},"Hard wheat",795,105,null,96,158,1154,0.27948655848873821,1.2215215530831944]
{"$rows_left_out":118}
{"sheet":"BudExp DHMax<55%","index":7,"n_rows":243,"n_cols":31,"rows_kept":243,"cut":false,"hidden":false,"merged":[[165,0,166,0],[165,1,165,2],[193,0,194,0],[193,1,193,2],[7,1,8,1],[7,2,8,2]]}
[]
[]
[]
["Etablissement du budget exploitation "]
[]
["I. Evolution l'Area sown (Ha)"]
[]
["  ","Area sown actual","Area sown target","w/o project","With project"]
["Cultures ",null,null,"Years 1-20 ","Years 1 ",2,3,4,5,6,7,8,9,10,"11-20"]
["Cereals",{"$f":"SUM(B11:B14)","v":2.3499999999999996},{"$f":"SUM(C11:C14)","v":2.3499999999999996},2.3499999999999996,2.3499999999999996,2.3499999999999996,2.3499999999999996,2.3499999999999996,2.3499999999999996,2.3499999999999996,2.3499999999999996,2.3499999999999996,2.3499999999999996,2.3499999999999996,2.3499999999999996]
{"$rows_left_out":234}
{"sheet":"Don_classe2","index":8,"n_rows":129,"n_cols":22,"rows_kept":129,"cut":false,"hidden":false,"merged":[[100,1,100,7],[100,13,100,19],[2,1,2,9],[2,13,2,21],[23,1,23,7],[23,13,23,19],[51,1,51,7],[80,1,80,7],[80,13,80,19]]}
[]
[]
[null,"Area sown_ Actual situation (ha)",null,null,null,null,null,null,null,null,null,null,null,"Area sown_ Situation With project"]
["Crop/Perimeter","Zekkara","Maamer Beni Khlil","Chichaoua amont","Outat El haj","Ourika","Ghmat","Total","Assol_Avg/Exp","Assol_Avg/Exp",null,null,"Crop/Perimeter","Zekkara","Maamer Beni Khlil","Chichaoua amont","Outat El haj","Ourika","Ghmat","Total","Assol_Avg/Exp","Assol_Avg/Exp"]
[" Olives",160,331,1200,1290,1600,920,{"$f":"SUM(B5:G5)","v":5501},{"$f":"H5/$H$22","v":0.88383676092544983},{"$f":"+'Data&assumptions'!C142","v":1.7},null,null," Olives",160,331,1200,1420,1600,920,{"$f":"SUM(N5:S5)","v":5631},{"$f":"T5/$T$22","v":0.90472365038560409},{"$f":"+J5*T5/H5","v":1.7401745137247771}]
["Dates",null,null,null,193,null,30,{"$f":"SUM(B6:G6)","v":223},3.5829048843187661E-2,{"$f":"+'Data&assumptions'!$C146*(I6/($I$6+$I$7))","v":0.12194393351880418},null,null,"Dates",null,null,null,253,null,30,{"$f":"SUM(N6:S6)","v":283},4.5469151670951155E-2,{"$f":"+J6*T6/H6","v":0.15475396047453627}]
["Other Trees,",null,null,440,59,50,30,579,9.3026992287917734E-2,{"$f":"+'Data&assumptions'!$C146*(I7/($I$6+$I$7))","v":0.31661676012281442},null,null,"Other Trees,",null,null,440,112,50,30,632,0.10154241645244216,0.34559895060037776]
["Oats ",60,null,null,0,null,0,60,9.640102827763496E-3,{"$f":"'Data&assumptions'!$D$129*(I8*($I$8+$I$10+$I$11+$I$15+$I$19))","v":2.2312710335148461E-2},null,null,"Oats ",60,null,null,0,null,0,60,9.640102827763496E-3,2.2312710335148461E-2]
["Bersim",null,null,122,0,20,220,362,5.8161953727506426E-2,{"$f":"+'Data&assumptions'!$D$131*(I11/($I$11+$I$14+$I$16))","v":0.37449223788977359},null,null,"Bersim",null,null,122,0,20,220,362,5.8161953727506426E-2,0.37449223788977354]
["Hard wheat",null,104.4,295,346,375,960,2080.4,0.33425449871465296,{"$f":"'Data&assumptions'!$D$129*(I10*($I$8+$I$10+$I$11+$I$15+$I$19))","v":0.77365604302071433},null,null,"Hard wheat",null,104.4,295,170,375,960,1904.4,0.30597686375321337,0.70820542603761216]
{"$rows_left_out":120}
{"sheet":"BudExp DHMax>55%","index":9,"n_rows":264,"n_cols":31,"rows_kept":264,"cut":false,"hidden":false,"merged":[[202,0,203,0],[202,1,202,2],[4,1,5,1],[4,2,5,2],[172,0,173,0],[172,1,172,2]]}
["The operating budget"]
[]
["I. Evolution of area sown (Ha)"]
[]
["  ","Area sown actual","Area sown target","Without project","With project"]
["Crops ",null,null,"Years 1-20 ","Years 1 ",2,3,4,5,6,7,8,9,10," 11 -20"]
["Cereals",{"$f":"SUM(B8:B12)","v":2.1515030940666904},{"$f":"SUM(C8:C12)","v":2.0064704768882251},{"$f":"SUM(D8:D12)","v":2.1515030940666904},2.1515030940666904,2.1515030940666904,2.0064704768882251,2.0064704768882251,2.0064704768882251,2.0064704768882251,2.0064704768882251,2.0064704768882251,2.0064704768882251,2.0064704768882251,{"$f":"SUM(O8:O12)","v":2.0064704768882251}]
["Soft wheat",{"$f":"Don_classe2!J11","v":0.47436822172525633},{"$f":"Don_classe2!V11","v":0.4360647356499181},{"$f":"B8","v":0.47436822172525633},{"$f":"B8","v":0.47436822172525633},{"$f":"E8","v":0.47436822172525633},{"$f":"C8","v":0.4360647356499181},{"$f":"G8","v":0.4360647356499181},0.4360647356499181,0.4360647356499181,0.4360647356499181,0.4360647356499181,0.4360647356499181,0.4360647356499181,0.4360647356499181]
["Hard wheat",{"$f":"Don_classe2!J10","v":0.77365604302071433},{"$f":"Don_classe2!V10","v":0.70820542603761216},{"$f":"B9","v":0.77365604302071433},{"$f":"B9","v":0.77365604302071433},{"$f":"E9","v":0.77365604302071433},{"$f":"C9","v":0.70820542603761216},0.70820542603761216,0.70820542603761216,0.70820542603761216,0.70820542603761216,0.70820542603761216,0.70820542603761216,0.70820542603761216,0.70820542603761216]
["Barley",{"$f":"Don_classe2!J19","v":0.81794677303598406},{"$f":"Don_classe2!V19","v":0.77666825891595936},0.81794677303598406,{"$f":"B10","v":0.81794677303598406},{"$f":"E10","v":0.81794677303598406},{"$f":"C10","v":0.77666825891595936},0.77666825891595936,0.77666825891595936,0.77666825891595936,0.77666825891595936,0.77666825891595936,0.77666825891595936,0.77666825891595936,0.77666825891595936]
{"$rows_left_out":255}
{"sheet":"DATA-enq reference","index":10,"n_rows":295,"n_cols":14,"rows_kept":295,"cut":false,"hidden":false,"merged":[[9,11,10,11],[2,2,3,2],[2,3,2,5],[2,6,2,8],[9,0,10,0],[9,1,10,1],[9,2,10,2],[9,3,9,4],[9,5,9,10],[2,9,2,11],[2,1,3,1],[178,0,178,1],[183,0,183,1],[174,0,174,1],[175,0,175,1],[177,0,177,1],[47,2,47,3],[47,4,47,5],[47,6,47,7],[115,0,115,1],[117,0,117,1],[107,0,107,1],[111,0,111,5],[114,0,114,1],[49,0,49,1],[50,0,53,0],[54,0,54,1],[55,0,55,1],[56,0,56,1],[195,0,195,1],[213,0,213,1],[210,0,210,1],[211,0,211,1],[184,0,184,1],[185,0,185,1],[192,0,192,1],[194,0,194,1],[191,0,191,1],[289,1,289,2],[289,3,289,4],[276,1,276,2],[276,3,276,4],[283,1,283,2],[283,3,283,4]]}
[]
["Table 3: Agricultural area in use (ha) in PMH zones"]
[null,"Variable","Estimation","Zone A (Deficit <55)",null,null,"Zone B (Deficit >55)",null,null,"Total"]
[null,null,null,"P","HP","T","P","HP","T","P","HP","T"]
[null,"SAU","Avg. (ha)",2.71,1.75,4.46,3.7,1.49,5.19,3.39,1.57,4.96]
[null,"SAU irrigated","Avg. (ha)",2.06,0.26,2.3199999999999998,3.23,0.45,3.68,2.86,0.39,3.26]
[null,null,null,"P : Perimeter",null,"HP : without perimeters",null,null,"T: Total"]
[]
["Table 7: Area sown in PMH zones"]
["Zone","Parameter","Number of parcels","Tree crops",null,"Area, annual crops (ha)",null,null,null,null,null,"Fallow (ha)"]
{"$rows_left_out":286}
{"sheet":"Data&assumptions","index":11,"n_rows":235,"n_cols":32,"rows_kept":235,"cut":false,"hidden":false,"merged":[[217,0,217,6],[226,0,226,6],[192,0,192,11],[193,0,193,12],[203,0,203,6],[204,0,204,12],[200,0,200,10],[189,0,189,3],[190,0,190,3],[176,1,176,2],[176,3,176,4],[176,5,176,6],[182,0,182,6],[187,0,187,7],[188,0,188,3],[188,6,189,9]]}
["Assumptions and data sources"]
["Hypothesiss"]
["5. This project will not have any intensification activities associated with it. Gains will be achieved by an increase of green fodder resources,"]
["grains and under valued products."]
["6. duration of life of the project:","25 yrs"]
["8. installation of the olive tree cost","20 DH/plant"]
["Data Sources:"]
["1. the data on crop rotation, the yield of crops, prices, production costs as well for the current situation as the future situation,"]
["provided by feasibility studies at the level of the perimeters of PMH. These data were collected by the consultant TC - 1B through the work centers related to"]
["the Ministry of Agriculture, and through participatory diagnostics carried out with farmers. Techno-economic records by Cropare also developed"]
{"$rows_left_out":226}
{"sheet":"total budget","index":12,"n_rows":566,"n_cols":31,"rows_kept":566,"cut":false,"hidden":false,"merged":[]}
[]
[]
[null,"Forecasted Cash Requirements for ->",null,"Cumulative TR","Cumulative","Cumulative with TR",null,null,null,null,null,null,null,null,null,null,null,null,null,"Prior","Prior","Prior","Prior","Current","Next",null,null,"Total "]
[null,null,"Contract #","Actual Cumulative \nTax \nReimbursements Received","Cumulative Actual Disbursements at Beginning of Current Period ","Cumulative Actual Disbursements at Beginning of Current Period incl Tax Reimbursement received (Sched. C, Col 3)","Compact Quarter 1","Compact Quarter 2","Compact Quarter 3","Compact Quarter 4","Compact Quarter 5","Compact Quarter 6","Compact Quarter\n7 ","Compact Quarter 8","Compact Quarter 9","Compact Quarter 10","Compact Quarter 11","Compact Quarter 12","Compact Quarter 13","Compact Quarter 14","Compact Quarter 15","Compact Quarter 16","Compact Quarter 17","Compact Quarter 18","Compact Quarter 19","Total Compact Quarter 20","Likely not to be paid/Not allocated","Cash Disbursements As Currently Forecasted"]
[null,"Calendar Month/Quarter ->",null,null,"31 Mar 13","31 Mar 13","Oct '08\nDec '08","Jan '09\nMar '09","Apr '09\nJun '09","Jul '09\nSep '09","Oct '09\nDec '09","Jan '10\nMar '10","Apr '10\nJun '10","Jul '10\nSep '10","Oct '10\nDec '10","Jan '11\nMar '11","Apr '11\nJun '11","Jul '11\nSep '11","Oct '11\nDec '11","Jan '12\nMar '12","Apr '12\nJun '12","Jul '12\nSep '12","Oct '12\nDec '12","Jan '13\nMar '13","Apr '13\nJun '13","Jul '13\nJan '14",null,null,null,"M&E share:","Admin share:"]
[8.4758099999999992,null,null,null,null,null,"(2+3+4)","(6+7+8)","(10+11+12)","(14+15+16)","(18+19+20)","(22+23+24)","(26+27+28)","(30+31+32)","(34+35+36)","(38+39+40)",null,"(46+47+48)","(50+51+52)","(54+55+56)"]
["BUDGET LINES",null,null,"Column 1a","Column 1b","Column 1 (1a+1b)","Column 5","Column 9","Column 13","Column 17","Column 21","Column 25","Column 29","Column 33","Column 37","Column 41","Column 45","Column 49","Column 53","Column 57","Column 61","Column 65","Column 69","Column 73","Column 77","Column 81","Column 80","Column 82"]
[1000000,"1. Fruit Tree Productivity Project"]
[1010000,"A. Rain-fed Olive, Almond and Fig Tree Intensification and Expansion","TC-01A,3A,5A",-2.3283064365386963E-10,105336621.87,105336621.87,0,0,432759,2868550.41,2369913.27,1671462,5502134.7700000005,3402239.29,5390410.3700000001,15185863.4,18523494.960000001,5575304.3499999996,6948547.5999999996,9954954.8399999999,9112561.7300000004,6624313.0199999996,4428387.63,7345725.2300000004,9285930.6499999985,13392470.518666666,9160193.1177586988,128015023.03866668,{"$f":"AB9/SUM($AB$9,$AB$26,$AB$39)","v":0.45844805420126389}]
[1010100,"Strategic Envrironmental Assessment and Feasibility Studies","TC-01A",0,14009040.609999999,14009040.609999999,0,0,432759,2318662.79,842486.53,844201,564469.73,1198009.3,554269.65999999992,890159.27,855473.76,571147.63,1149771.23,577835.09000000008,576244.14,1462305.29,582132.6,589113.59000000008,1461323.1800000002,1537413.1300000004,0.29000000096857548,17007776.919999998]
{"$rows_left_out":557}
{"sheet":"fruit tree budget","index":13,"n_rows":112,"n_cols":31,"rows_kept":112,"cut":false,"hidden":false,"merged":[[2,27,3,27],[2,28,3,28]]}
[]
[]
[null,null,null,null,null,null,null,"Compact Quarter 1","Compact Quarter 2","Compact Quarter 3","Compact Quarter 4","Compact Quarter 5","Compact Quarter 6","Compact Quarter\n7 ","Compact Quarter 8","Compact Quarter 9","Compact Quarter 10","Compact Quarter 11","Compact Quarter 12","Compact Quarter 13","Compact Quarter 14","Compact Quarter 15","Compact Quarter 16","Compact Quarter 17","Compact Quarter 18","Compact Quarter 19","Total Compact Quarter 20","Likely not to be paid/Not allocated","Cash Disbursements As Currently Forecasted"]
[null,null,"Calendar Month/Quarter ->",null,null,"31 Mar 13","31 Mar 13","Oct '08\nDec '08","Jan '09\nMar '09","Apr '09\nJun '09","Jul '09\nSep '09","Oct '09\nDec '09","Jan '10\nMar '10","Apr '10\nJun '10","Jul '10\nSep '10","Oct '10\nDec '10","Jan '11\nMar '11","Apr '11\nJun '11","Jul '11\nSep '11","Oct '11\nDec '11","Jan '12\nMar '12","Apr '12\nJun '12","Jul '12\nSep '12","Oct '12\nDec '12","Jan '13\nMar '13","Apr '13\nJun '13","Jul '13\nJan '14"]
[null,1000000,"1. Fruit Tree Productivity Project"]
[null,1010000,"A. Rain-fed Olive, Almond and Fig Tree Intensification and Expansion","TC-01A,3A,5A",-2.3283064365386963E-10,105336621.87,105336621.87,0,0,432759,2868550.41,2369913.27,1671462,5502134.7700000005,3402239.29,5390410.3700000001,15185863.4,18523494.960000001,5575304.3499999996,6948547.5999999996,9954954.8399999999,9112561.7300000004,6624313.0199999996,4428387.63,7345725.2300000004,9285930.6499999985,13392470.518666666,9160193.1177586988,128015023.03866668]
["ok",1010100,"Strategic Envrironmental Assessment and Feasibility Studies","TC-01A",0,14009040.609999999,14009040.609999999,0,0,432759,2318662.79,842486.53,844201,564469.73,1198009.3,554269.65999999992,890159.27,855473.76,571147.63,1149771.23,577835.09000000008,576244.14,1462305.29,582132.6,589113.59000000008,1461323.1800000002,1537413.1300000004,0.29000000096857548,17007776.919999998]
["ok",1010200,"Mitigation and Management of Environmental and Social Impacts","TC-G-01A1",0,157138.48000000001,157138.48000000001,0,0,0,0,0,0,0,0,21413.06,23986.1,0,11453.59,0,33415.46,43899.16,0,0,22971.11,22529.64,42722.84,-0.27000000000407454,222390.96]
["ok",1010300,"Training of Beneficiaries and their Professional Organizations","TC-05A",0,4425321.66,4425321.66,0,0,0,0,0,0,0,0,348723.54000000004,0,813688.54,193735.37,735314.65000000014,410350.67,460276.37,670831.06000000006,324084.28000000003,468317.18,519679.39999999997,899062.74,0.87999999965541065,5844063.8000000007]
[null,1010400,"Expansion of plantings in rainfed areas (120,000 Ha)","TC-03AP, 03A1-3",0,81119149.829999998,81119149.829999998,0,0,0,549887.62,1527426.74,827261,4937665.04,2204229.9900000002,4022174.1100000003,14271718.030000001,15818729.060000001,4552395.4700000007,4133863.02,8411089.129999999,7446335.7700000005,3637391.69,3109699.8600000003,5669283.2999999998,6620988.2899999991,9592435.6486666668,7568903.771333335,97332573.76866667]
{"$rows_left_out":102}