{"text_format":"1","workbook":"xlsx","n_sheets":19,"sheets":["User's Guide","Project Description","ERR & Sensitivity Analysis","Combined Cost-Benefit","eTIS","iReturns","Pub awareness","Citizen-Cent SS","NSW","X-ray img sys","Petrol invtry sys","Harmon rules&regs","CAATT","RIPS","Assumptions & Data","WB NRIMP Tax Tables","1970-2008 Raw Data","Notes","Cost summary (Feb 09)"],"not_rendered":{"charts":1,"images":2,"macros":1,"external_links":0,"defined_names":0,"comments":14,"pivot_tables":0},"unopened":[],"bounds":{"document_bytes":16777216,"sheet_cells":100000,"rows_first":2000,"rows_last":500,"rows_between":2000,"halvings":0,"cell_chars":16384,"cell_head_chars":4096},"cells_cut":0,"cells_raw":0,"read":"whole","date_system":"1900"}

{"sheet":"User's Guide","index":0,"n_rows":55,"n_cols":3,"rows_kept":55,"cut":false,"hidden":false,"merged":[[51,0,51,1],[50,0,50,1],[54,0,54,1],[53,0,53,1],[40,0,40,1],[44,0,45,1],[43,0,43,1],[48,0,48,1],[47,0,47,1],[34,2,35,2],[44,2,45,2],[1,1,4,2],[11,0,17,0],[18,0,19,0],[25,0,25,1],[24,0,24,1],[28,0,28,1],[27,0,27,1],[31,0,31,1],[30,0,30,1],[34,0,35,1],[33,0,33,1],[38,0,38,1],[37,0,37,1],[41,0,41,1]]}
[null,null,"Last updated: May 2017"]
[null,"Philippines: Revenue Administration Reform Project (RARP)"]
[]
[]
[]
[]
[]
["Project name","Revenue Administration Reform Project (RARP)","Revenue Administration Reform Project (RARP)"]
["Spreadsheet version","Investment memo, final*","Closeout ERR"]
["Date of ERR","2011-01-07T14:04:21","May 2017"]
{"$rows_left_out":46}
{"sheet":"Project Description","index":1,"n_rows":26,"n_cols":2,"rows_kept":26,"cut":false,"hidden":false,"merged":[]}
[null,"Last updated: May 2017"]
[null,"Philippines: Revenue Administration Reform Project (RARP)"]
[]
[null,"Project Description"]
[]
[null,"Summary"]
[]
[null,"Original Project"]
[null,"This project addresses what the Asian Development Bank identifies as the Philippines‘ most significant constraint to growth: its tight fiscal position. The Philippines‘ tax effectiveness (the ratio of tax revenue to GDP) is the lowest in the region and has fallen slightly in recent years, straining the ability of the government to fund social programs. "]
[null,"RARP provided technical assistance, software, and hardware to the Bureau of Internal Revenue (BIR) to modernize its policies and procedures in order to increase tax payer compliance and increase tax revenues. By taking steps to reduce opportunities for negotiated tax assessments and by increasing the likelihood of detection of non-compliance, this project will also contribute to an improved business climate and, indirectly, to increased investment."]
{"$rows_left_out":17}
{"sheet":"ERR & Sensitivity Analysis","index":2,"n_rows":31,"n_cols":9,"rows_kept":31,"cut":false,"hidden":false,"merged":[[5,1,7,6],[14,7,19,7],[18,1,18,6],[9,1,10,1],[9,2,10,2],[9,3,9,6]]}
[]
[null,"Philippines: Revenue Administration Reform Project (RARP)",null,null,null,null,null,null,"Last updated: May 2017"]
[]
[null,"ERR and sensitivity analysis"]
[]
[null,"Change the \"User Input\" cells in the table below to see the effect on the compact's Economic Rate of Return (ERR) and net benefits (see chart below).  To reset all values to the default MCC estimates, click the \"Reset Parameters\" button at right.  Be sure to reset all summary parameters to their original values (\"MCC Estimate\" values) before changing specific parameters."]
[]
[]
[]
[null,"Parameter type","Description of key parameters","Parameter Values"]
{"$rows_left_out":22}
{"sheet":"Combined Cost-Benefit","index":3,"n_rows":122,"n_cols":30,"rows_kept":122,"cut":false,"hidden":false,"merged":[[92,6,93,6],[92,7,93,7],[92,8,93,8],[92,9,93,9],[20,6,20,29],[80,6,81,6],[80,7,81,7],[80,8,81,8],[80,9,81,9]]}
[null,"Philippines: Revenue Administration Reform Project (RARP)",null,null,null,null,null,null,null,"Last updated: May 2017"]
[{"$f":"IF('ERR & Sensitivity Analysis'!$I$12=\"y\",IF('ERR & Sensitivity Analysis'!$I$16=\"y\",\"\",\"Note: Current calculations are based on user input and are not the original MCC estimates\"),\"Note: Current calculations are based on user input and are not the original MCC estimates\")","v":""}]
[]
[null,null,null,null,"ERR = ",{"$f":"IRR(J24:AD24)","v":0.3466277099880577},null,"(Unless otherwise indicated, monetary figures in constant 2009 US dollars)"]
[]
["Cost resulting ERR equal to hurdle:",null,null,null,null,4.13]
["Benefit resulting ERR equal to hurdle:",null,null,null,null,0.28000000000000003]
[]
[null,"Sensitivity Analysis Shock Factors"]
[null,"eTIS"]
{"$rows_left_out":113}
{"sheet":"eTIS","index":4,"n_rows":119,"n_cols":30,"rows_kept":119,"cut":false,"hidden":false,"merged":[[8,6,8,29],[77,9,78,9],[44,9,45,9],[47,9,48,9],[51,9,52,9],[54,9,55,9],[58,9,59,9],[61,9,62,9],[64,9,65,9],[68,9,69,9],[71,9,72,9],[74,9,75,9]]}
[null,"Philippines: Revenue Administration Reform Project (RARP)",null,null,null,null,null,null,null,null,null,null,"Last updated: May 2017"]
[{"$f":"IF('ERR & Sensitivity Analysis'!I12=\"y\",IF('ERR & Sensitivity Analysis'!I16=\"y\",\"\",\"Note: Current calculations are based on user input and are not the original MCC estimates\"),\"Note: Current calculations are based on user input and are not the original MCC estimates\")","v":""}]
[]
[null,null,null,null,"ERR = ",{"$f":"IRR(J12:AD12)","v":0.30232920075329606},null,"(Unless otherwise indicated, monetary figures in constant 2009 US dollars)"]
[null,null,null,null,"Project Costs as % of baseline =",{"$f":"'ERR & Sensitivity Analysis'!G12","v":1}]
[null,null,null,null,"Benefits as % of baseline =",{"$f":"'ERR & Sensitivity Analysis'!G13","v":1}]
[null,null,null,null,"Reallocation - % revenue of 13 pilot sites:",0.75]
["Cost resulting ERR equal to hurdle:",null,null,null,null,3.37]
["Benefit resulting ERR equal to hurdle:",null,null,null,null,0.31,"Year"]
[null,null,null,null,null,null,2007,2008,2009,2010,2011,2012,2013,2014,2015,2016,2017,2018,2019,2020,2021,2022,2023,2024,2025,2026,2027,2028,2029,2030]
{"$rows_left_out":110}
{"sheet":"iReturns","index":5,"n_rows":103,"n_cols":30,"rows_kept":103,"cut":false,"hidden":true,"merged":[]}
["(Unless otherwise indicated, monetary figures in constant 2009 US dollars)",null,null,null,null,null,null,null,null,"Year"]
[null,null,null,null,"ERR = ",{"$f":"IRR(J5:AD5)","v":{"$error":"#VALUE!"}},2007,2008,2009,2010,2011,2012,2013,2014,2015,2016,2017,2018,2019,2020,2021,2022,2023,2024,2025,2026,2027,2028,2029,2030]
[null,null,null,null,null,null,-3,-2,-1,0,1,2,3,4,5,6,7,8,9,10,11,12,13,14,15,16,17,18,19,20]
[]
["Net benefits",null,null,null,null,null,null,null,null,{"$f":"J30-J8","v":{"$error":"#REF!"}},{"$f":"K30-K8","v":{"$error":"#REF!"}},{"$error":"#REF!"},{"$error":"#REF!"},{"$error":"#REF!"},{"$error":"#REF!"},{"$error":"#REF!"},{"$error":"#REF!"},{"$error":"#REF!"},{"$error":"#REF!"},{"$error":"#REF!"},{"$error":"#REF!"},{"$error":"#REF!"},{"$error":"#REF!"},{"$error":"#REF!"},{"$error":"#REF!"},{"$error":"#REF!"},{"$error":"#REF!"},{"$error":"#REF!"},{"$error":"#REF!"},{"$error":"#REF!"}]
[]
["Costs"]
[null,"Total costs (incl. admin & controls) by year",null,null,null,null,null,null,null,{"$f":"SUM(J9:J10)","v":0},{"$f":"SUM(K9:K10)","v":1667522.7272727273},{"$f":"SUM(L9:L10)","v":3560386.3636363638},3677563.6363636362,4416681.8181818184,4867363.6363636367,1983000,1983000,1983000,1983000,1983000,1983000,1983000,1983000,1983000,1983000,1983000,1983000,1983000,1983000,1983000]
[null,null,"MCC",null,null,null,null,null,null,{"$f":"J12+J24","v":0},{"$f":"K12+K24","v":1667522.7272727273},{"$f":"L12+L24","v":3335045.4545454546},3001540.9090909092,3335045.4545454546,3335045.4545454546,0,0,0,0,0,0,0,0,0,0,0,0,0,0,0]
[null,null,"GRP",null,null,null,null,null,null,{"$f":"J13+J26","v":0},{"$f":"K13+K26","v":0},{"$f":"L13+L26","v":225340.90909090909},676022.72727272718,1081636.3636363635,1532318.1818181816,1983000,1983000,1983000,1983000,1983000,1983000,1983000,1983000,1983000,1983000,1983000,1983000,1983000,1983000,1983000]
{"$rows_left_out":94}
{"sheet":"Pub awareness","index":6,"n_rows":49,"n_cols":30,"rows_kept":49,"cut":false,"hidden":true,"merged":[]}
[null,null,null,null,null,null,null,null,null,"Year"]
[null,null,null,null,null,null,2007,2008,2009,2010,2011,2012,2013,2014,2015,2016,2017,2018,2019,2020,2021,2022,2023,2024,2025,2026,2027,2028,2029,2030]
[null,null,null,null,null,null,-3,-2,-1,0,1,2,3,4,5,6,7,8,9,10,11,12,13,14,15,16,17,18,19,20]
["Costs"]
["Total costs"]
[null,"Investment costs"]
[]
[null,"Incremental operating costs"]
[]
[null,"Recurrent project costs"]
{"$rows_left_out":40}
{"sheet":"Citizen-Cent SS","index":7,"n_rows":50,"n_cols":30,"rows_kept":50,"cut":false,"hidden":true,"merged":[]}
[null,null,null,null,null,null,null,null,null,"Year"]
[null,null,null,null,null,null,2007,2008,2009,2010,2011,2012,2013,2014,2015,2016,2017,2018,2019,2020,2021,2022,2023,2024,2025,2026,2027,2028,2029,2030]
[null,null,null,null,null,null,-3,-2,-1,0,1,2,3,4,5,6,7,8,9,10,11,12,13,14,15,16,17,18,19,20]
["Costs"]
["Total costs"]
[null,"Investment costs"]
[]
[null,"Incremental operating costs"]
[]
[null,"Recurrent project costs"]
{"$rows_left_out":41}
{"sheet":"NSW","index":8,"n_rows":104,"n_cols":30,"rows_kept":104,"cut":false,"hidden":true,"merged":[]}
[null,null,null,null,null,null,null,null,null,"Year"]
[null,null,null,null,null,null,2007,2008,2009,2010,2011,2012,2013,2014,2015,2016,2017,2018,2019,2020,2021,2022,2023,2024,2025,2026,2027,2028,2029,2030]
[null,null,null,null,null,null,-3,-2,-1,0,1,2,3,4,5,6,7,8,9,10,11,12,13,14,15,16,17,18,19,20]
["Costs"]
["Total costs"]
[null,"Investment costs"]
[]
[null,"Incremental operating costs"]
[]
[null,"Recurrent project costs"]
{"$rows_left_out":95}
{"sheet":"X-ray img sys","index":9,"n_rows":51,"n_cols":30,"rows_kept":51,"cut":false,"hidden":true,"merged":[]}
[null,null,null,null,null,null,null,null,null,"Year"]
[null,null,null,null,null,null,2007,2008,2009,2010,2011,2012,2013,2014,2015,2016,2017,2018,2019,2020,2021,2022,2023,2024,2025,2026,2027,2028,2029,2030]
[null,null,null,null,null,null,-3,-2,-1,0,1,2,3,4,5,6,7,8,9,10,11,12,13,14,15,16,17,18,19,20]
["Costs"]
["Total costs"]
[null,"Investment costs"]
[]
[null,"Incremental operating costs"]
[]
[null,"Recurrent project costs"]
{"$rows_left_out":42}
{"sheet":"Petrol invtry sys","index":10,"n_rows":59,"n_cols":30,"rows_kept":59,"cut":false,"hidden":true,"merged":[]}
[null,null,null,null,null,null,null,null,null,"Year"]
[null,null,null,null,null,null,2007,2008,2009,2010,2011,2012,2013,2014,2015,2016,2017,2018,2019,2020,2021,2022,2023,2024,2025,2026,2027,2028,2029,2030]
[null,null,null,null,null,null,-3,-2,-1,0,1,2,3,4,5,6,7,8,9,10,11,12,13,14,15,16,17,18,19,20]
["Costs"]
["Total costs"]
[null,"Investment costs"]
[]
[null,"Incremental operating costs"]
[]
[null,"Recurrent project costs"]
{"$rows_left_out":50}
{"sheet":"Harmon rules&regs","index":11,"n_rows":49,"n_cols":30,"rows_kept":49,"cut":false,"hidden":true,"merged":[]}
[null,null,null,null,null,null,null,null,null,"Year"]
[null,null,null,null,null,null,2007,2008,2009,2010,2011,2012,2013,2014,2015,2016,2017,2018,2019,2020,2021,2022,2023,2024,2025,2026,2027,2028,2029,2030]
[null,null,null,null,null,null,-3,-2,-1,0,1,2,3,4,5,6,7,8,9,10,11,12,13,14,15,16,17,18,19,20]
["Costs"]
["Total costs"]
[null,"Investment costs"]
[]
[null,"Incremental operating costs"]
[]
[null,"Recurrent project costs"]
{"$rows_left_out":40}
{"sheet":"CAATT","index":12,"n_rows":112,"n_cols":30,"rows_kept":112,"cut":false,"hidden":false,"merged":[[9,6,9,29]]}
[null,"Philippines: Revenue Administration Reform Project (RARP)",null,null,null,null,null,null,null,null,null,null,"Last updated: May 2017"]
[{"$f":"IF('ERR & Sensitivity Analysis'!I12=\"y\",IF('ERR & Sensitivity Analysis'!I16=\"y\",\"\",\"Note: Current calculations are based on user input and are not the original MCC estimates\"),\"Note: Current calculations are based on user input and are not the original MCC estimates\")","v":""}]
[]
[null,null,null,null,"ERR = ",{"$f":"IRR(J13:AD13)","v":0.74912056429281582},null,"(Unless otherwise indicated, monetary figures in constant 2009 US dollars)"]
[null,"Sensitivity Analysis Shock Factors"]
[null,null,null,null,"Project Costs as % of baseline =",{"$f":"'ERR & Sensitivity Analysis'!G12","v":1}]
[null,null,null,null,"Benefits as % of baseline =",{"$f":"'ERR & Sensitivity Analysis'!G13","v":1}]
[]
["Cost resulting ERR equal to hurdle:",null,null,null,null,4.2]
["Benefit resulting ERR equal to hurdle:",null,null,null,null,0.25,"Year"]
{"$rows_left_out":103}
{"sheet":"RIPS","index":13,"n_rows":64,"n_cols":30,"rows_kept":64,"cut":false,"hidden":false,"merged":[[9,6,9,29]]}
[null,"Philippines: Revenue Administration Reform Project (RARP)",null,null,null,null,null,null,null,null,null,null,null,"Last updated: May 2017"]
[{"$f":"IF('ERR & Sensitivity Analysis'!I12=\"y\",IF('ERR & Sensitivity Analysis'!I16=\"y\",\"\",\"Note: Current calculations are based on user input and are not the original MCC estimates\"),\"Note: Current calculations are based on user input and are not the original MCC estimates\")","v":""}]
[]
[null,null,null,null,"ERR = ",{"$f":"IRR(J13:AD13)","v":0.5020079378457063},null,"(Unless otherwise indicated, monetary figures in constant 2009 US dollars)"]
[null,"Sensitivity Analysis Shock Factors"]
[null,null,null,null,"Project Costs as % of baseline =",{"$f":"'ERR & Sensitivity Analysis'!G12","v":1}]
[null,null,null,null,"Benefits as % of baseline =",{"$f":"'ERR & Sensitivity Analysis'!G13","v":1}]
[]
["Cost resulting ERR equal to hurdle:",null,null,null,null,6.88]
["Benefit resulting ERR equal to hurdle:",null,null,null,null,0.15,"Year"]
{"$rows_left_out":55}
{"sheet":"Assumptions & Data","index":14,"n_rows":195,"n_cols":39,"rows_kept":195,"cut":false,"hidden":false,"merged":[[3,6,3,38],[4,0,4,4],[97,0,97,5],[43,0,43,5],[23,0,23,5],[104,0,104,5],[157,0,157,5],[180,0,180,5],[184,0,184,5],[193,0,193,5]]}
[null,"Philippines: Revenue Administration Reform Project (RARP)",null,null,null,null,null,null,null,null,null,null,null,"Last updated: May 2017"]
[null,{"$f":"IF('ERR & Sensitivity Analysis'!I12=\"y\",IF('ERR & Sensitivity Analysis'!I16=\"y\",\"\",\"Note: Current calculations are based on user input and are not the original MCC estimates\"),\"Note: Current calculations are based on user input and are not the original MCC estimates\")","v":""}]
["(Unless otherwise indicated, monetary figures in constant 2009 US dollars)"]
[null,null,null,null,null,null,"Year"]
["Time Series",null,null,null,null,"Units",1998,1999,2000,2001,2002,2003,2004,2005,2006,2007,2008,2009,2010,2011,2012,2013,2014,2015,2016,2017,2018,2019,2020,2021,2022,2023,2024,2025,2026,2027,2028,2029,2030]
["Official exchange rate",null,null,null,null,"PHP/$",40.893050000000002,39.088983333333303,44.192250000000001,50.992649999999998,51.603566666666701,54.203333333333298,56.039916666666699,55.085491666666698,51.314272500000001,46.148391177755002,44.474560934768803,46.5,{"$f":"R6","v":46.5},{"$f":"S6","v":46.5},46.5,46.5,46.5,46.5,46.5,46.5,46.5,46.5,46.5,46.5,46.5,46.5,46.5,46.5,46.5,46.5,{"$f":"AJ6","v":46.5},46.5,46.5]
["Real GDP growth rate",null,null,null,null,"%",{"$f":"-0.576722189193092/100","v":-5.7672218919309201E-3},3.3963963963963999E-2,5.9684586564433303E-2,1.75567340897879E-2,4.4494071968663902E-2,4.9297306915335501E-2,6.3794903743625994E-2,4.9518691485241198E-2,5.34101750694373E-2,7.0788153287707406E-2,3.8389875931086802E-2,1.4999999999999999E-2,3.5000000000000003E-2,4.1000000000000002E-2,4.2999999999999997E-2,4.3999999999999997E-2,4.4999999999999998E-2,{"$f":"W7","v":4.4999999999999998E-2},{"$f":"X7","v":4.4999999999999998E-2},4.4999999999999998E-2,4.4999999999999998E-2,4.4999999999999998E-2,4.4999999999999998E-2,4.4999999999999998E-2,4.4999999999999998E-2,4.4999999999999998E-2,4.4999999999999998E-2,4.4999999999999998E-2,4.4999999999999998E-2,4.4999999999999998E-2,4.4999999999999998E-2,4.4999999999999998E-2,4.4999999999999998E-2]
["GDP (base year = 1985)",null,null,null,null,"const. 1985 PHP",{"$f":"G10/(G9/100)","v":888000000000.0011},{"$f":"H10/(H9/100)","v":918159999999.99878},972959999999.99902,990042000000.00085,1034092999999.9996,1085071000000,1154292999999.999,1211452078950.5715,1276155946575.5566,1366492669340.7695,1418952153377.5,{"$f":"Q8*(100%+R7)","v":1440236435678.1624},1490644710926.8979,1551761144074.9006,1618486873270.1213,1689700295694.0068,1765736809000.2371,1845194965405.2476,1928228738848.4836,2014999032096.6653,2105673988541.0151,2200429318025.3608,2299448637336.502,2402923826016.6445,2511055398187.3936,2624052891105.8262,2742135271205.5884,2865531358409.8398,2994480269538.2822,3129231881667.5049,3270047316342.5425,3417199445577.9565,3570973420628.9644]
["GDP deflator (Philippines; base year = 1985)",null,null,null,null,"#",300.119369369369,324.22508059597499,344.79598339089,366.79999434367397,383.31871504787301,397.79913019516698,422.03790545381497,449.381264012364,472.60399256476501,486.45252318319598,523.14753508854699,{"$f":"Q9*1.028","v":537.79566607102629},{"$f":"R9*1.04","v":559.3074927138673},{"$f":"S9*1.042","v":582.79840740784971},{"$f":"T9*1.043","v":607.85873892638722},{"$f":"U9*1.044","v":634.60452343914824},{"$f":"V9*1.045","v":663.16172699390984},{"$f":"W9*1.045","v":693.00400470863576},{"$f":"X9*1.045","v":724.18918492052433},756.77769824194786,790.83269466283548,826.42016592266305,863.60907338918287,902.471481691696,943.08269836782222,985.5214197943742,1029.8698836851211,1076.2140284509514,1124.6436597312443,1175.2526244191502,1228.1389925180117,1283.4052471813222,1341.1584833044817]
["GDP",null,null,null,null,"current PHP",2665060000000,2976905000000,3354727000000,3631474000000,3963872000000,4316403000000,4871554000000,5444038665292.1396,6031163954868.75,6647338069121.5801,7423213214480.25,{"$f":"R8*(R9/100)","v":7745529132252.9814},8337287557957.1084,9043639234442.3496,9838113897548.875,10722914509038.83,{"$f":"W8*(W9/100)","v":11709690716733.127},12787275004940.492,13964023987270.139,15249063294698.672,16652358344393.316,18184791621036.109,19858247069961.957,21685702256575.203,23681329006736.535,25860603308581.461,28240425328053.672,30839250468867.812,33677232493265.363,36776379813458.109,40160726165791.578,43856516991198.547,47892412967313.586]
{"$rows_left_out":186}
{"sheet":"WB NRIMP Tax Tables","index":15,"n_rows":34,"n_cols":8,"rows_kept":34,"cut":false,"hidden":false,"merged":[[4,0,4,6],[16,0,16,3],[26,0,27,3],[29,0,29,6],[5,0,6,0],[5,1,6,1],[5,2,5,6],[18,4,22,4]]}
[]
["Philippines: Revenue Administration Reform Project (RARP)",null,null,null,null,null,null,"Last updated: May 2017"]
["Data Available From The World Bank Project Aprasial Document For The National Roads Improvement And Management Program."]
[{"$f":"IF('ERR & Sensitivity Analysis'!I12=\"y\",IF('ERR & Sensitivity Analysis'!I16=\"y\",\"\",\"Note: Current calculations are based on user input and are not the original MCC estimates\"),\"Note: Current calculations are based on user input and are not the original MCC estimates\")","v":""}]
["Table 1: Number of Registered Taxpayers"]
["Year","Employees","Businesses"]
[null,null,"Corporate","Professional","Individual","Total Business","VAT (active)"]
[2002,3815956,135228,54048,624241,{"$f":"SUM(C8:E8)","v":813517},{"$f":"204441+5979","v":210420}]
[2003,4327955,148849,68539,696179,{"$f":"SUM(C9:E9)","v":913567},{"$f":"225942+6985","v":232927}]
[2004,4903949,161551,77505,759997,999053,{"$f":"243700+8093","v":251793}]
{"$rows_left_out":25}
{"sheet":"1970-2008 Raw Data","index":16,"n_rows":143,"n_cols":43,"rows_kept":143,"cut":false,"hidden":false,"merged":[[76,0,142,0],[100,1,101,1],[100,3,101,4],[100,6,101,7],[69,4,69,5],[74,2,74,3],[73,2,73,3],[72,2,72,3],[71,2,71,3],[70,2,70,3],[69,2,69,3],[44,0,74,0],[74,4,74,5],[73,4,73,5],[72,4,72,5],[71,4,71,5],[70,4,70,5],[65,4,65,5],[64,4,64,5],[63,4,63,5],[62,4,62,5],[68,4,68,5],[67,4,67,5],[66,4,66,5],[61,4,61,5],[61,2,61,3],[60,2,60,3],[57,4,57,5],[60,4,60,5],[59,4,59,5],[58,4,58,5],[68,2,68,3],[67,2,67,3],[5,41,5,43],[4,1,4,39],[43,1,43,9],[54,2,56,3],[58,2,58,3],[57,2,57,3],[66,2,66,3],[65,2,65,3],[64,2,64,3],[63,2,63,3],[62,2,62,3],[59,2,59,3],[54,1,56,1],[54,4,56,5]]}
[]
["Philippines: Revenue Administration Reform Project (RARP)",null,null,null,null,null,null,null,null,"Last updated: May 2017"]
["Data available from the Philippines Bureau of Internal Revenue."]
[{"$f":"IF('ERR & Sensitivity Analysis'!I12=\"y\",IF('ERR & Sensitivity Analysis'!I16=\"y\",\"\",\"Note: Current calculations are based on user input and are not the original MCC estimates\"),\"Note: Current calculations are based on user input and are not the original MCC estimates\")","v":""}]
[null,"Year"]
[null,1970,1971,1972,1973,1974,1975,1976,1977,1978,1979,1980,1981,1982,1983,1984,1985,1986,1987,1988,1989,1990,1991,1992,1993,1994,1995,1996,1997,1998,1999,2000,2001,2002,2003,2004,2005,2006,2007,2008," ","All figures are in PhP Billions."]
["NGREVNOMINAL",4.8490000000000002,5.8689999999999998,5.99,10.367000000000001,17.722000000000001,21.425999999999998,21.027000000000001,24.803000000000001,30.146000000000001,35.26,32.56,35.933,38.176679999999998,46.339919999999999,57.413699999999999,67.576340000000002,78.524199999999993,103.214,112.861,152.41,180.90199999999999,220.78700000000003,242.71400000000003,260.40500000000003,336.16,361.22,410.44899999999996,471.84300000000002,462.51499999999999,478.50199999999995,514.76200000000006,567.48299999999995,578.40600000000006,639.7360000000001,706.71800000000007,816.15899999999999,979.63799999999992,1136.6049999999998,1225,null,"NG","National Govt"]
["NGREVCONS",4.8490000000000002,5.2147183353061557,4.9323287501163895,7.3598127774383295,9.5174415759226587,10.636532923296736,9.5602293939661855,10.499431344547338,11.687802096065941,11.862373485337571,9.4758033430591073,10.108639119922833,9.8111740450745923,10.329830597077265,8.4661447122202897,8.7375687917583402,9.6388467426837856,11.817294475975832,12.294344357261185,15.226608243411688,15.9979754145143,16.755949281059845,17.066226006666191,17.139177721208352,20.115382984757883,20.097411741767921,21.211382799580672,22.955303664049122,20.371181553050796,19.508403011376906,19.362160058132545,20.064712829895647,19.384946358303747,20.851892317083518,21.721847789426402,23.529150446129691,26.861978716452295,30.313623884816781,29.973529537768833,null,"REV","Revenue"]
["NGSAVINGS CONS",930.25,497.12641141656081,-41.171358515161884,2390.3240688371616,4684.0720813225053,2905.1148449142393,1228.0486799402047,983.77931882143378,1673.3415327612502,2569.9566379606827,2144.5698659398822,-0.79280836485454143,-1128.0284838683415,821.64425822010492,40.35942305990848,-482.24216966869517,-1868.5989312151764,-432.78405176806069,-868.41790535336554,158.74995406325712,-440.40374105471818,1255.956171352198,2223.051828187738,1950.7369065420046,4650.1277053670292,4458.3589235227118,4025.5597291941453,4708.1001712001553,2329.1983915548321,228.92210044865232,-916.94945993906413,-1442.3336566380633,-2897.8920632971435,-3809.289774540176,-2567.2129686297089,-497.9366600203553,2070.4802701616236,4789.6198958307878,3553.6769536907068,null,"EXP","Expenditure"]
["EXP",4.79,6.0519999999999996,7.0010000000000003,9.3000000000000007,14.3,22.373999999999999,23.526,27.526,32.601999999999997,35.749000000000002,38.118000000000002,48.079000000000001,52.61,53.063000000000002,66.926000000000002,80.102000000000004,109.83799999999999,119.907,136.06700000000001,171.97800000000001,218.09599999999995,247.136,258.68,282.29600000000005,319.87399999999997,350.14600000000002,404.19299999999998,470.279,512.49600000000009,590.16,648.97399999999993,713.49700000000018,789.14699999999993,839.60500000000002,893.77499999999998,962.94600000000003,1044.4290000000001,1149.001,1300,null,"NOM","Nominal"]
{"$rows_left_out":134}
{"sheet":"Notes","index":17,"n_rows":33,"n_cols":8,"rows_kept":33,"cut":false,"hidden":false,"merged":[[28,0,28,1],[29,0,30,1],[32,0,32,1],[3,0,3,1],[25,0,25,1],[26,0,26,1],[27,0,27,1],[31,0,31,1]]}
[]
["Philippines: Revenue Administration Reform Project (RARP)",null,null,null,null,null,null,"Last updated: May 2017"]
[]
["Abbreviations used in this spreadsheet"]
["[number]","Page number of the relevant document"]
["BIR","Bureau of Internal Revenue"]
["CP","Concept Paper (unless otherwise noted, 02/09 version)"]
["CP Ann N","Concept Paper (unless otherwise noted, 02/09 version), Annex N"]
["FDI","Foreign direct investment"]
["FY","Fiscal year"]
{"$rows_left_out":24}
{"sheet":"Cost summary (Feb 09)","index":18,"n_rows":41,"n_cols":16,"rows_kept":41,"cut":false,"hidden":true,"merged":[[0,7,0,11]]}
["Department/Project Name ",null,null,null,null,null,null,"Amount (in 2009 USD)"]
[null,null,null,null,null,null,null,"Feb '09 proposal","D. Gaugler rev's (May '09)","T.  Campbell rev's (May '09)","Satori/Booz-Allen (20Nov09)","Current best estimate","In/?/Out \n(= 1/0.5/0) per May mission rpt.","Expected cost"]
["DEPARTMENT OF FINANCE (Main Office) ",null,null,null,null,null,null,{"$f":"SUM(H4:H5)","v":18000000},null,null,null,null,null,{"$f":"SUM(N4:N5)","v":4000000}]
[null,"Financial Management Information System (FMIS) ",null,null,null,null,null,10000000,null,null,null,{"$f":"H4","v":10000000},0,{"$f":"L4*M4","v":0}]
[null,"Revenue Integrity Protection Service (RIPS) ",null,null,null,null,null,8000000,null,4000000,4000000,{"$f":"J5","v":4000000},1,{"$f":"L5*M5","v":4000000}]
[]
["BUREAU OF INTERNAL REVENUE (BIR) ",null,null,null,null,null,null,{"$f":"SUM(H8:H19)","v":61959400},null,null,null,null,null,{"$f":"SUM(N8:N19)","v":54669000}]
[null,"Electronic Tax Information System (eTIS)",null,null,null,null,null,24966000,25626000,null,27100000,{"$f":"I8","v":25626000},1,{"$f":"L8*M8","v":25626000},{"$f":"N8+SUM(N14:N16)","v":38870000},"including supporting components"]
[null,"IMF project management",null,null,null,null,null,null,null,null,6500000]
[null,"Process Redesign",null,null,null,null,null,null,null,null,1000000]
{"$rows_left_out":31}